⌂ все дашборды/Прочее← Nightly-Bugs-A-2022BAYAREA · NotPeople-Pitch-Drafts →
Ночной санитар MyOwnPC-Natalia

Ночной санитар -- MyOwnPC-Natalia

машина MyOwnPC-Natalia -- собрано 2026-09-25 03:41 -- разбор: НЕ выполнен

180НАШЕ (на разбор)
16ЖДЁТ ХАБА (файл не доехал)
12ОКРУЖЕНИЕ (нет пакета)
1ЧУЖОЕ (другая машина/ОС)
класстестпоследняя строка
НАШЕ (на разбор)~\.claude\hooks\_test_hooks.py11 passed, 2 failed
НАШЕ (на разбор)~\.claude\hooks\_test_no_silent_wait.py5/6 passed
НАШЕ (на разбор)~\.claude\hooks\_test_onair_fleet_guard.pyКРАСНЫХ: 5 -> ['клоббер при чистой доске: НЕ блок (exit 0)', 'клоббер при чистой доске: advisory напечатан', '
ОКРУЖЕНИЕ (нет пакета)~\.claude\hooks\_test_task_card_guard.pyERR: нужен pyyaml (pip install pyyaml)
НАШЕ (на разбор)~\.claude\scripts\_shared\_test_browser_rail_watch.pyAttributeError: module '_bcl' has no attribute 'judge_outcome'
НАШЕ (на разбор)~\.claude\scripts\_shared\_test_chrome_login_shield.py- cookiedb-new-preferred: got False want True
НАШЕ (на разбор)~\.claude\scripts\_shared\_test_claude_md_daily.py2 FAILED: движок: --selftest ALL PASS; задача 'Claude MD Daily Optimizer' стоит И ВКЛЮЧЕНА
НАШЕ (на разбор)~\.claude\scripts\_shared\_test_consensus_s10.py68/69 PASSED <-- FAILURES ABOVE
НАШЕ (на разбор)~\.claude\scripts\_shared\_test_cron_watchdog_drift.pyAttributeError: module 'cron_watchdog' has no attribute 'guess_threshold'
НАШЕ (на разбор)~\.claude\scripts\_shared\_test_fb_session_check.pyRED: 1 -> возраст lastAccessed посчитан
НАШЕ (на разбор)~\.claude\scripts\_shared\_test_fireat_now.pyFAIL ДВЕРЬ ОБОЙДЕНА: spawn_args() не берёт время у двери fireat_now
НАШЕ (на разбор)~\.claude\scripts\_shared\_test_screenpipe_pulse.pyscreenpipe_pulse: не понял аргумент: --чепуха (знаю: --verbose, --help, -h)
НАШЕ (на разбор)~\.claude\scripts\_shared\_test_stignore_guard.pyREST не ответил (timed out) -> проверить не удалось, зелёным это НЕ считается
НАШЕ (на разбор)~\.claude\scripts\_shared\_test_tg_chunk_poison.py== ИТОГ: 🔴 КРАСНО: 7 ==
НАШЕ (на разбор)~\.claude\scripts\_shared\claude_md_daily.py2 FAILED
НАШЕ (на разбор)~\.claude\scripts\_shared\rule_liveness.pyИТОГО: 17 PASS, 1 FAIL
НАШЕ (на разбор)~\.claude\scripts\_test_ack_race.pyX TEST1 race: 17/25 orders LOST despite the lock: ['race-order-00-unique-3', 'race-order-01-unique-10', 'rac
ЖДЁТ ХАБА (файл не доехал)~\.claude\scripts\_test_ack_watchdog_scheduled.pyFileNotFoundError: [WinError 2] Не удается найти указанный файл
НАШЕ (на разбор)~\.claude\scripts\_test_approval_chat_door.pyAttributeError: module 'appr_chat' has no attribute 'cmd_chat'. Did you mean: 'cmd_check'?
НАШЕ (на разбор)~\.claude\scripts\_test_ask_once_class_a.pyAttributeError: module 'ask_once' has no attribute 'is_class_a'
НАШЕ (на разбор)~\.claude\scripts\_test_auto_improve.pyFAIL: ['журнал существует']
НАШЕ (на разбор)~\.claude\scripts\_test_bom_scan.pyFAILED: 1
НАШЕ (на разбор)~\.claude\scripts\_test_brain_gold_eval_nightly.pyFAIL: 6b настоящая таблица в выводе = успех
ЖДЁТ ХАБА (файл не доехал)~\.claude\scripts\_test_breakage_journal.pyTEST CRASH: FileNotFoundError(2, 'No such file or directory')
ЖДЁТ ХАБА (файл не доехал)~\.claude\scripts\_test_brno_guides_watch.pyFileNotFoundError: [WinError 2] Не удается найти указанный файл
НАШЕ (на разбор)~\.claude\scripts\_test_browser_usage_log.pyИТОГ: ❌ провалено 12 -- T1 запись легла в локальный запас; T2 один факт = одна попытка (не удвоено двумя корня
НАШЕ (на разбор)~\.claude\scripts\_test_canon_index.pyFAILURES: live-vault-check-is-clean-after-generation (1 failures)
НАШЕ (на разбор)~\.claude\scripts\_test_canon_writer_is_publisher.py2 FAILED
НАШЕ (на разбор)~\.claude\scripts\_test_claim_keeps_signature.pyRED: 3 провал(ов): 0 baseline: исходная запись проверяется, 3 sig_survives: подпись после claim по-прежнему сх
ОКРУЖЕНИЕ (нет пакета)~\.claude\scripts\_test_claude_cli_reaper.pyModuleNotFoundError: No module named 'psutil'
НАШЕ (на разбор)~\.claude\scripts\_test_claude_fleet_stage.pyКРАСНОЕ (4 из 7): НОВЫЙ движок попал в канал, НОВЫЙ скилл попал в канал, паспорт из scripts/docs попал, cwd бо
НАШЕ (на разбор)~\.claude\scripts\_test_claude_run_auth.pyFAILED 3: logged out + child exit 0 -> AUTH_FAIL_RC (126), not 0, says out loud what to do (`claude setup-toke
НАШЕ (на разбор)~\.claude\scripts\_test_claude_run_extfallback.pyAttributeError: module 'claude_run' has no attribute 'LLM_ASK'
НАШЕ (на разбор)~\.claude\scripts\_test_clone_gate_fanout_leg.pyFAIL: dr_headless_dispatch.rail_env('grok') не кладёт DR_FANOUT_RAIL
НАШЕ (на разбор)~\.claude\scripts\_test_code_provenance.pyAttributeError: module 'code_provenance_lint' has no attribute 'USAGE_ENV'
ЖДЁТ ХАБА (файл не доехал)~\.claude\scripts\_test_compact_guard.pyFileNotFoundError: [WinError 2] Не удается найти указанный файл: 'C:\\Users\\Huawei\\.claude\\state\\compact_p
НАШЕ (на разбор)~\.claude\scripts\_test_consensus_s10.py68/69 PASSED <-- FAILURES ABOVE
НАШЕ (на разбор)~\.claude\scripts\_test_contrib_watch.pyИТОГ: ❌ сторож считает не то
ЖДЁТ ХАБА (файл не доехал)~\.claude\scripts\_test_contrib_watch_tick.pyFileNotFoundError: [WinError 2] Не удается найти указанный файл
НАШЕ (на разбор)~\.claude\scripts\_test_cron_watchdog_fb_session.pyAttributeError: module 'cw' has no attribute 'FB_HOST'. Did you mean: 'ME_HOST'?
НАШЕ (на разбор)~\.claude\scripts\_test_cron_watchdog_probe_throttle.pyFAILED (failures=1)
НАШЕ (на разбор)~\.claude\scripts\_test_deploy_apply_timeout.pyRED: 1 провал(ов): бэкап старого кода на месте (иначе красноту не показать)
НАШЕ (на разбор)~\.claude\scripts\_test_deploy_cargo.py- [D1] razoshedshihsya dublei relsy dostavki
НАШЕ (на разбор)~\.claude\scripts\_test_deploy_cargo_gate.pyИТОГ: КРАСНОЕ: install отказал (exit 1), не тронут aaa.py, не тронут zzz.py, бэкапов не наплодил
НАШЕ (на разбор)~\.claude\scripts\_test_deploy_deadwood.pyRED: 3 fail
ЖДЁТ ХАБА (файл не доехал)~\.claude\scripts\_test_deploy_gate.pyFileNotFoundError: [Errno 2] No such file or directory: 'C:\\Users\\Huawei\\AppData\\Local\\Temp\\deploy-gate-
НАШЕ (на разбор)~\.claude\scripts\_test_deploy_me_bare_env.pyКРАСНЫХ: 3 -> ['canon_key срезает .local', 'canon_key срезает .lan', 'в лесенке ME есть ступень machine.env (m
НАШЕ (на разбор)~\.claude\scripts\_test_deploy_payload_install.py1 красных: 1) функция _dropped_docs существует
НАШЕ (на разбор)~\.claude\scripts\_test_deploy_shards.pyКРАСНОЕ: T2 read_pending видит шард без рендера, T2 addressed() правдив по шарду, T12 новый canon-шард создан,
НАШЕ (на разбор)~\.claude\scripts\_test_deploy_status_split.pySELFTEST: 27 passed, 2 failed
НАШЕ (на разбор)~\.claude\scripts\_test_door_before_mouth.pyFAIL 1: T3 у каждого прибора есть echo-метка rc сразу после запуска
ЧУЖОЕ (другая машина/ОС)~\.claude\scripts\_test_dr_debt_root.py- сторож стоит на расписании (launchd)
НАШЕ (на разбор)~\.claude\scripts\_test_dr_door_gate.pyAttributeError: module 'dr_queue' has no attribute '_gate_doors'. Did you mean: 'rail_doors'?
НАШЕ (на разбор)~\.claude\scripts\_test_dr_ff_collect_alarm.pyЕСТЬ КРАСНОЕ (ОС: Windows)
НАШЕ (на разбор)~\.claude\scripts\_test_dr_ff_rail_mistral_door.pyFAIL: dr_glm_relay.RAIL_META держит mistral как 'browser-chrome-mcp': безлюдная рутина по реестру привезти её
НАШЕ (на разбор)~\.claude\scripts\_test_dr_ff_rail_ready.pyКРАСНО
НАШЕ (на разбор)~\.claude\scripts\_test_dr_queue_rail_doors.pyПРОВАЛЕНО 1: пустая очередь = тихий выход без doors
НАШЕ (на разбор)~\.claude\scripts\_test_dr_rails_body_door.pyFAIL: MACHINE_BUS_DIR задан, а шину ищем в волте — это двойник шины
ЖДЁТ ХАБА (файл не доехал)~\.claude\scripts\_test_dr_rails_registry.pyFileNotFoundError: [Errno 2] No such file or directory: 'C:\\Users\\Huawei\\.claude\\dr_rails.json'
НАШЕ (на разбор)~\.claude\scripts\_test_dr_raw_dir_race.pyAttributeError: module 'dr_headless_dispatch' has no attribute 'write_raw'
НАШЕ (на разбор)~\.claude\scripts\_test_dr_runner_browser_leg.pyFAIL: dr_runner.order_missing() нет — плечо не знает, чего не хватает заказу
НАШЕ (на разбор)~\.claude\scripts\_test_dr_runner_covers_quorum.py• кворум недостижим ПО ПОСТРОЕНИЮ: заказ = 6 целей (chatgpt,gemini,grok,claudeai,glm,mistral), кворум требуе
ЖДЁТ ХАБА (файл не доехал)~\.claude\scripts\_test_dr_runner_tick.pyFileNotFoundError: [WinError 2] Не удается найти указанный файл
НАШЕ (на разбор)~\.claude\scripts\_test_dr_targets_glm.pyВЕРДИКТ: УЗЕЛ ОТСТАЛ по: дефолтный веер не читается: module 'dr_start' has no attribute '_default_targets'
НАШЕ (на разбор)~\.claude\scripts\_test_export_import_contract.py:52: SyntaxWarning: invalid escape sequence '\s'
НАШЕ (на разбор)~\.claude\scripts\_test_fireat_now.pyFAIL ДВЕРЬ ОБОЙДЕНА: spawn_args() не берёт время у двери fireat_now
НАШЕ (на разбор)~\.claude\scripts\_test_fleet_routines_audit.pyFAILED (failures=2)
НАШЕ (на разбор)~\.claude\scripts\_test_fleet_routines_verdicts.py❌ КРАСНЫЙ: 1 проверок упало: ['живой выход существует']
НАШЕ (на разбор)~\.claude\scripts\_test_fleet_run_status.pyAttributeError: module 'frd' has no attribute 'load_expected'
НАШЕ (на разбор)~\.claude\scripts\_test_github_lane_freshness.pyи обвал назван вслух: получил False, ждал True
НАШЕ (на разбор)~\.claude\scripts\_test_github_routines_registry.pyКРАСНОЕ: свежий лейн со ссылкой = 🟢
НАШЕ (на разбор)~\.claude\scripts\_test_have_fast.pyFAIL _test_have_fast: TimeoutExpired: have.py bus_send.py не ответил за 5 с / TimeoutExpired: --budget 3 не ос
НАШЕ (на разбор)~\.claude\scripts\_test_headless_llm_watchdog.py9/13 PASS
НАШЕ (на разбор)~\.claude\scripts\_test_help_flag_lint.pyупали: D1 новых дыр во флоте нет (exit 0)
НАШЕ (на разбор)~\.claude\scripts\_test_heredoc_escape_guard.pyитог: 0/14
НАШЕ (на разбор)~\.claude\scripts\_test_hook_roster_substr.pyПодробности построчно: python ~/.claude/scripts/substr_lint.py --roster
НАШЕ (на разбор)~\.claude\scripts\_test_hooks_selftest_static.pyAttributeError: module 'hooks_selftest' has no attribute '_exe_unquoted_backslash'
НАШЕ (на разбор)~\.claude\scripts\_test_inbox_debt_hook.pyитог: 14/16
НАШЕ (на разбор)~\.claude\scripts\_test_installer_python_literal.pyЛечи: sys.executable (свой запуск) или платформенная развилка (запись в settings/планировщик).
НАШЕ (на разбор)~\.claude\scripts\_test_interpreter_pin.pyUnicodeDecodeError: 'utf-8' codec can't decode byte 0x88 in position 1: invalid start byte
НАШЕ (на разбор)~\.claude\scripts\_test_journal_scan.py✗ следующий прогон доводит остаток
НАШЕ (на разбор)~\.claude\scripts\_test_journey_llms_full.pyTypeError: build() takes 0 positional arguments but 1 was given
НАШЕ (на разбор)~\.claude\scripts\_test_lead_rail_gate.pyRED: в inbox_robot.cmd пропал кусок lead-рельсы: lead rail
НАШЕ (на разбор)~\.claude\scripts\_test_lead_thread_receipt.pyAttributeError: module 'lead_thread_watch' has no attribute '_is_receipt'
НАШЕ (на разбор)~\.claude\scripts\_test_lease_dir_scope.pyFAILED (errors=4)
НАШЕ (на разбор)~\.claude\scripts\_test_lease_storm.pyFAIL 9. МУТАНТ НЕ ПОКРАСНЕЛ: старый хук обязан отбить запись в ДРУГОЙ файл занятой папки (rc=1). Тест ничего н
НАШЕ (на разбор)~\.claude\scripts\_test_llm_ask_omniroute.pyКРАСНО: 1 кейс(ов) упало: test_no_subscription_creds
НАШЕ (на разбор)~\.claude\scripts\_test_llm_ask_openrouter.pyllm_ask: openrouter: fake/model ответила за 0.1s, потрачено $0.00000
НАШЕ (на разбор)~\.claude\scripts\_test_lock_ttl.py[LOCK-STUCK] @***ySsd lock held 1790287316s by pid 11044 (TTL 300s) and it will not let go (owner lives on SOM
НАШЕ (на разбор)~\.claude\scripts\_test_machine_key_bare_env_gate.py❌ B2 ноль голых чтений MACHINE_KEY без лестницы нарушители: dr_debt_watch.py, fleet_sheet_registry_push.py, is
НАШЕ (на разбор)~\.claude\scripts\_test_memory_epistemic_breaker.pyFAILED: B8 verify_yaml refuses broken YAML and missing frontmatter
ЖДЁТ ХАБА (файл не доехал)~\.claude\scripts\_test_memory_tidy.pyFileNotFoundError: [WinError 2] Не удается найти указанный файл
НАШЕ (на разбор)~\.claude\scripts\_test_no_control_bytes.py:52: SyntaxWarning: invalid escape sequence '\s'
НАШЕ (на разбор)~\.claude\scripts\_test_notforme_own_pending.py2 FAIL: T5 назван путь утилизации (discarded), T7 после --not-for-me своя посылка по-прежнему в списке (правда
НАШЕ (на разбор)~\.claude\scripts\_test_oauth_probe_expiry.pyAttributeError: module 'oauth_probe' has no attribute 'EXPIRY_STORES'
НАШЕ (на разбор)~\.claude\scripts\_test_operator_escalation_channel.py[FAIL] оператор без хендла -> эскалация пропала совсем; должна уйти без @-пинга
НАШЕ (на разбор)~\.claude\scripts\_test_orphan_mouth.py6 FAILED: T2 вывод чистый: только вердикт, без простыни чужих проверок; T3 без no_cure освобождённые цели снов
НАШЕ (на разбор)~\.claude\scripts\_test_pay_proof_guard.pyTypeError: pay() got an unexpected keyword argument 'register_head'
НАШЕ (на разбор)~\.claude\scripts\_test_pr_watch_bot_is_not_a_move.pyКРАСНО: 1
НАШЕ (на разбор)~\.claude\scripts\_test_publish_canon_unsigned_guard.pyFAILED: 3a unsigned-over-unsigned still allowed, 3b still shouts UNSIGNED, 4b dry-run wording is a block, not
НАШЕ (на разбор)~\.claude\scripts\_test_py39_union_lint.pyКРАСНЫХ: 1 -- 8. боевой touchbase.py чист
ЖДЁТ ХАБА (файл не доехал)~\.claude\scripts\_test_raters_recheck.pyFileNotFoundError: [Errno 2] No such file or directory: 'C:\\Users\\_\\.claude\\skills\\taste-check\\SKILL.md.
ЖДЁТ ХАБА (файл не доехал)~\.claude\scripts\_test_retro_lost_consumer_contract.pyFileNotFoundError: [Errno 2] No such file or directory: 'C:\\Users\\Huawei\\.claude\\scheduled-tasks\\auto-hub
НАШЕ (на разбор)~\.claude\scripts\_test_robot_watchdog.pyx T8 missing creds -> auth-death alert
НАШЕ (на разбор)~\.claude\scripts\_test_routine_probe_truth.pyAttributeError: module 'rrc' has no attribute 'known_outputs'
НАШЕ (на разбор)~\.claude\scripts\_test_rule_home_guard_door.pyКРАСНО: 7 проверок упало -> 1. несуществующий слаг: вердикт БЕЗ ДВЕРИ присутствует, 2. слаг с дверью: вердикт
НАШЕ (на разбор)~\.claude\scripts\_test_rule_home_guard_hookdoor.pyAttributeError: module 'rule_home_guard' has no attribute 'registered_hook_files'
НАШЕ (на разбор)~\.claude\scripts\_test_s4u_probe.pyRED: 16 failing checks -> ack_coverage_watch.py routes through schtask_s4u, no bare schtasks /create left; ins
НАШЕ (на разбор)~\.claude\scripts\_test_scripts_share.pyTimeoutError: timed out
НАШЕ (на разбор)~\.claude\scripts\_test_secret_broker.pyИТОГ: 20/21 OK · брокер: C:\Users\Huawei\.claude\scripts\secret_broker.py
НАШЕ (на разбор)~\.claude\scripts\_test_seed_vs_scheduler.pyКРАСНЫХ: 1 -> ['реальный сид git-s7-fast найден на диске']
НАШЕ (на разбор)~\.claude\scripts\_test_selfheal_amend.pyFAILED (failures=8)
НАШЕ (на разбор)~\.claude\scripts\_test_selfheal_card_dedup.pyитог: 3 ok, 2 fail
ЖДЁТ ХАБА (файл не доехал)~\.claude\scripts\_test_selfheal_class_match.pyclass-match test CRASH: FileNotFoundError(2, 'No such file or directory')
НАШЕ (на разбор)~\.claude\scripts\_test_selfheal_family_warn.pyFAILED (errors=8)
НАШЕ (на разбор)~\.claude\scripts\_test_signal_map.pyAttributeError: module 'frd_test' has no attribute 'load_expected'
НАШЕ (на разбор)~\.claude\scripts\_test_skill_refs.pyvoice-sessions: НЕТ ДВИЖКА -> vd_run.py
НАШЕ (на разбор)~\.claude\scripts\_test_snapshot_authorship.pyKeyError: 't_signed'
НАШЕ (на разбор)~\.claude\scripts\_test_spawn_slot_guard.py❌ провалов: 4 из 21
ОКРУЖЕНИЕ (нет пакета)~\.claude\scripts\_test_tasks_readers.pyERR: нужен pyyaml (pip install pyyaml)
НАШЕ (на разбор)~\.claude\scripts\_test_tg_channel_post_body.pyКРАСНО: 2 из 5
ОКРУЖЕНИЕ (нет пакета)~\.claude\scripts\_test_tg_translate_3chats.pyModuleNotFoundError: No module named 'dotenv'
НАШЕ (на разбор)~\.claude\scripts\_test_tool_doors.pyFAILED: T6, T7, T10
НАШЕ (на разбор)~\.claude\scripts\_test_unknown_flag_guard.py- quarantine.py --help: ЗАВИС
НАШЕ (на разбор)~\.claude\scripts\_test_verify_sweep.pyAttributeError: module 'deploy_lib' has no attribute 'verify_predates_parcel'
НАШЕ (на разбор)~\.claude\scripts\_test_voice001_door.py❌ ПРОВАЛЕНО 2: дверь /voice001 без токена -> 403, чужой путь -> 404
НАШЕ (на разбор)~\.claude\scripts\_test_voice001_nodup.py❌ ПРОВАЛЕНО 2: токен двери читается, test_old_message_is_never_raised
НАШЕ (на разбор)~\.claude\scripts\_test_voice_dispatch.py❌ SKILL.md дежурного не найден -- рутина не создана?
НАШЕ (на разбор)~\.claude\scripts\_test_wa_broker_accounts.py- wa_broker.ACCOUNTS нет: брокер знает только ОДИН аккаунт -> рельса wa2 без owner'а
НАШЕ (на разбор)~\.claude\scripts\_test_wa_broker_kill.py- _kill_pid ушла в РЕКУРСИЮ на ветке nt (зовёт саму себя вместо taskkill)
ЖДЁТ ХАБА (файл не доехал)~\.claude\scripts\_test_wa_broker_patchcheck.pyFileNotFoundError: [WinError 3] Системе не удается найти указанный путь: 'C:\\Users\\Huawei\\AppData\\Roaming\
НАШЕ (на разбор)~\.claude\scripts\_test_wa_broker_watch.pyAttributeError: module 'wa_broker' has no attribute 'ACCOUNTS'
НАШЕ (на разбор)~\.claude\scripts\_test_wa_qr_live.pyКРАСНОЕ (1 из 22): селфтест выходит 0, а не 4
ОКРУЖЕНИЕ (нет пакета)~\.claude\scripts\_test_wa_vendor_patch.pyModuleNotFoundError: No module named 'psutil'
НАШЕ (на разбор)~\.claude\scripts\_test_workclaim_store_cutover.pyRESULT 33/35 passed
ЖДЁТ ХАБА (файл не доехал)~\.claude\scripts\_test_workflow_harvest_sweep.pyFileNotFoundError: [WinError 2] Не удается найти указанный файл
НАШЕ (на разбор)~\.claude\scripts\_test_zenodo_deposit.pyFAILED (errors=1)
ЖДЁТ ХАБА (файл не доехал)~\.claude\scripts\agent_chrome_hypothesis.pyFileNotFoundError: [WinError 2] Не удается найти указанный файл
ОКРУЖЕНИЕ (нет пакета)~\.claude\scripts\cc-review\_iso\codex\.tmp\plugins\plugins\data-analytics\skills\build-report\report-to-google-doc\scripts\tests\test_portable_fallback.pyModuleNotFoundError: No module named 'bs4'
НАШЕ (на разбор)~\.claude\scripts\cc-review\_iso\codex\.tmp\plugins\plugins\data-analytics\skills\create-data-context\tests\test_state_helpers.pyFAILED (failures=1, errors=1)
НАШЕ (на разбор)~\.claude\scripts\cc-review\_iso\codex\.tmp\plugins\plugins\ngs-analysis\tests\test_new_backend_planners.pyFAILED (failures=3, errors=8)
ОКРУЖЕНИЕ (нет пакета)~\.claude\scripts\cc-review\_iso\codex\.tmp\plugins\plugins\plugin-eval\fixtures\ts-python-sample\tests\test_sample.pyModuleNotFoundError: No module named 'src'
НАШЕ (на разбор)~\.claude\scripts\cc-review\_iso\codex\.tmp\plugins\plugins\public-equity-investing\skills\user-context\tests\test_state_helpers.pyFAILED (failures=62, errors=1)
НАШЕ (на разбор)~\.claude\scripts\cc-review\_iso\codex\.tmp\plugins\plugins\public-equity-investing\tests\test_dashboard_kind_contract.pyFAILED (failures=1, errors=1)
НАШЕ (на разбор)~\.claude\scripts\cc-review\_iso\codex\.tmp\plugins\plugins\public-equity-investing\tests\test_deliverable_framework.pyFAILED (failures=30, errors=18)
НАШЕ (на разбор)~\.claude\scripts\cc-review\_iso\codex\.tmp\plugins\plugins\public-equity-investing\tests\test_equity_model_update_workbook.pyFAILED (errors=1)
НАШЕ (на разбор)~\.claude\scripts\cc-review\_iso\codex\.tmp\plugins\plugins\public-equity-investing\tests\test_equity_research_support_layer_contracts.pyFAILED (failures=1)
НАШЕ (на разбор)~\.claude\scripts\cc-review\_iso\codex\.tmp\plugins\plugins\public-equity-investing\tests\test_financials_normalizer_public_equity_contract.pyFAILED (failures=1)
НАШЕ (на разбор)~\.claude\scripts\cc-review\_iso\codex\.tmp\plugins\plugins\public-equity-investing\tests\test_markdown_support_policy.pyFAILED (failures=1)
НАШЕ (на разбор)~\.claude\scripts\cc-review\_iso\codex\.tmp\plugins\plugins\public-equity-investing\tests\test_model_workbook_artifacts.pyFAILED (failures=4, errors=8)
НАШЕ (на разбор)~\.claude\scripts\cc-review\_iso\codex\.tmp\plugins\plugins\public-equity-investing\tests\test_pm_judgment_language.pyFAILED (errors=1)
НАШЕ (на разбор)~\.claude\scripts\cc-review\_iso\codex\.tmp\plugins\plugins\public-equity-investing\tests\test_stale_public_markets_language.pyFAILED (errors=1)
НАШЕ (на разбор)~\.claude\scripts\cc-review\_test_orouter_fan.pyAttributeError: module 'orouter_review' has no attribute 'models_for'
НАШЕ (на разбор)~\.claude\scripts\cc-review\_test_orouter_roles.py❌ `ask --help` предлагает role=none
НАШЕ (на разбор)~\.claude\scripts\files\_test_browser_usage_log.pyjson.decoder.JSONDecodeError: Expecting value: line 1 column 1 (char 0)
ЖДЁТ ХАБА (файл не доехал)~\.claude\scripts\github_universe\_test_aipolicy.pyFileNotFoundError: [WinError 2] Не удается найти указанный файл
НАШЕ (на разбор)~\.claude\scripts\inbox_ack.pySELFTEST: СЛОМАН
НАШЕ (на разбор)~\.claude\scripts\oss-publish\_test_authorship_gate.pyAttributeError: module 'sanitize_skills' has no attribute 'authorship'
НАШЕ (на разбор)~\.claude\scripts\oss-publish\_test_lead_name_declension.pyFAIL
НАШЕ (на разбор)~\.claude\scripts\repair_session.py- claude не резолвится через PATH/PATHEXT — сессия не стартует
ОКРУЖЕНИЕ (нет пакета)~\.claude\scripts\tasks\_test_tasks_readers.pyERR: нужен pyyaml (pip install pyyaml)
НАШЕ (на разбор)~\.claude\scripts\test_delegate_no_vacuous_green.py7 failed in 0.65s
НАШЕ (на разбор)~\.claude\scripts\wa_qr_live.pySELFTEST FAIL
НАШЕ (на разбор)$IMPORTS\_test_ab_recall.pyRESULT: RED ❌
НАШЕ (на разбор)$IMPORTS\_test_backup_healthcheck_drivefs.pyRESULT: FAIL (1): prefix-not-sibling
НАШЕ (на разбор)$IMPORTS\_test_brain_temporal.pyopenai index missing -> fallback e5
НАШЕ (на разбор)$IMPORTS\_test_brain_vec_store.pyИТОГ: КРАСНЫЙ
НАШЕ (на разбор)$IMPORTS\_test_build_bible_moc.pyRED: секция Прочее не разрослась
НАШЕ (на разбор)$IMPORTS\_test_chunk_heading_path.py· ВЫКЛ: сторож называет причину выключения
НАШЕ (на разбор)$IMPORTS\_test_dr_fact_lint.pyFAILS (1): no ✅ for the fabricated ref
НАШЕ (на разбор)$IMPORTS\_test_essence_registries.pyFileNotFoundError: [Errno 2] No such file or directory: 'D:\\OBSIDIAN\\_imports\\_brain_answer_rr.txt'
НАШЕ (на разбор)$IMPORTS\_test_lock_exit.pyUnicodeDecodeError: 'utf-8' codec can't decode byte 0x88 in position 0: invalid start byte
НАШЕ (на разбор)$IMPORTS\_test_reindex_frequent.pyUnicodeDecodeError: 'utf-8' codec can't decode byte 0x8d in position 24: invalid start byte
НАШЕ (на разбор)$IMPORTS\ab-cofounder\_test_ab_harness.pyКРАСНОЕ: провалено 1 -> claude найден
НАШЕ (на разбор)$IMPORTS\alpha\_test_alpha_route.pyRED: 2 fail(s): credits=1 (малформ скипнут), rerun: подпроцессов 0
НАШЕ (на разбор)$IMPORTS\alpha\_test_harvest_gap.pyFileNotFoundError: [Errno 2] No such file or directory: 'E:\\Obsidian\\_imports\\alpha\\alpha_harvest.py'
НАШЕ (на разбор)$IMPORTS\arch\_test_sys_scan_disabled.pyUnicodeDecodeError: 'utf-8' codec can't decode byte 0x8f in position 6800: invalid start byte
НАШЕ (на разбор)$IMPORTS\backup\_test_mass_delete_gate.pyUnicodeDecodeError: 'utf-8' codec can't decode byte 0x88 in position 5: invalid start byte
НАШЕ (на разбор)$IMPORTS\brain_vec_store.pySELFTEST: КРАСНЫЙ
НАШЕ (на разбор)$IMPORTS\call-bot\_test_followup_quality.pykrasnoe: crm_handle: polnoe imya -> vernyy hendl
НАШЕ (на разбор)$IMPORTS\chatgpt\_test_chatgpt_accounts.pyRESULT: 28 ok, 1 FAILED -> в реестре НЕТ значений-токенов
НАШЕ (на разбор)$IMPORTS\chatlane\_test_chatlane.pyКРАСНО: 1 из проверок упало -> реестр читается
НАШЕ (на разбор)$IMPORTS\claude-ai\_test_pull_rail_c.pyRED: no bundles in raw/
ОКРУЖЕНИЕ (нет пакета)$IMPORTS\claude-ai\_test_railc_false_ok.pyModuleNotFoundError: No module named 'playwright'
НАШЕ (на разбор)$IMPORTS\content-factory\_test_approved_provenance.pyRED: упало 1 -- реальная копилка читается
НАШЕ (на разбор)$IMPORTS\content-factory\_test_daily_community.pyFileNotFoundError: [Errno 2] No such file or directory: 'C:\\Users\\Huawei\\AppData\\Local\\Temp\\dc-test-wdhk
НАШЕ (на разбор)$IMPORTS\content-factory\_test_ledger_all_writers.pyКРАСНО: 4 проверок упало
НАШЕ (на разбор)$IMPORTS\content-factory\_test_pipeline_stage_owners.pyFileNotFoundError: [Errno 2] No such file or directory: 'D:\\OBSIDIAN\\_imports\\content-factory\\pipeline_sta
НАШЕ (на разбор)$IMPORTS\content-factory\_test_platform_gate.py_test_platform_gate: 19 проверок, 1 красных
НАШЕ (на разбор)$IMPORTS\content-factory\_test_portability_gate.pyFAIL: 1
ОКРУЖЕНИЕ (нет пакета)$IMPORTS\content-factory\_test_tg_post_ledger.pyModuleNotFoundError: No module named 'tg_post_ledger'
НАШЕ (на разбор)$IMPORTS\crm-engine\_test_doping_channels.pyAssertionError: {'handle': 'tg-lead', 'action': 'error', 'why': 'AttributeError("\'_FakeTg\' object has no att
НАШЕ (на разбор)$IMPORTS\cv-events\_test_cv_dates.pyFileNotFoundError: [Errno 2] No such file or directory: 'D:\\OBSIDIAN\\_imports\\cv-events\\cv_alpha.json'
НАШЕ (на разбор)$IMPORTS\cv-events\_test_cv_lane_date_verified.pyFileNotFoundError: [Errno 2] No such file or directory: 'D:\\OBSIDIAN\\_imports\\cv-events\\cv_alpha.json'
НАШЕ (на разбор)$IMPORTS\cv-events\_test_cv_tg_handles_live.pysqlite3.OperationalError: no such table: contacts
НАШЕ (на разбор)$IMPORTS\cv-events\cv_mine.pyFileNotFoundError: [Errno 2] No such file or directory: 'cv_events.json'
НАШЕ (на разбор)$IMPORTS\cv-events\cv_outreach.pyFileNotFoundError: [Errno 2] No such file or directory: 'D:\\OBSIDIAN\\_imports\\cv-events\\cv_alpha.json'
НАШЕ (на разбор)$IMPORTS\cv-events\cv_outreach_daily.pyFileNotFoundError: [Errno 2] No such file or directory: 'D:\\OBSIDIAN\\_imports\\cv-events\\cv_alpha.json'
НАШЕ (на разбор)$IMPORTS\cv-events\event_dates_fetch.pyFileNotFoundError: [Errno 2] No such file or directory: 'cv_alpha.json'
НАШЕ (на разбор)$IMPORTS\cv-events\luma_apply.pyselftest FAILED
НАШЕ (на разбор)$IMPORTS\dialogs\_test_archive_exit_codes.pyX кейс 2: непонятный вывод: did not find executable at 'C:\Users\_\AppData\Local\Programs\Python\Python313\p
НАШЕ (на разбор)$IMPORTS\jobs-watch\_test_sources_sheet.pysqlite3.OperationalError: no such table: jobs
НАШЕ (на разбор)$IMPORTS\jobs-watch\apply_engines\_test_proc_lib.pyTypeError: argument of type 'NoneType' is not iterable
НАШЕ (на разбор)$IMPORTS\orphan-scan\curated_queue.pyFileNotFoundError: [Errno 2] No such file or directory: 'D:\\OBSIDIAN\\_imports\\orphan-scan\\orphan_policy.js
ОКРУЖЕНИЕ (нет пакета)$IMPORTS\screenpipe\_test_sp_harvest.pyModuleNotFoundError: No module named '_paths'
НАШЕ (на разбор)$IMPORTS\sync\_test_derived_writers.pyКРАСНОЕ: t_no_bare_idempotent_class, t_bleeders_are_registered[_onair/ACTIVE_NOW.md] (М3: 43 копий / 9 суток /
ОКРУЖЕНИЕ (нет пакета)$IMPORTS\tasks\_test_task_rank.pyERR: нужен pyyaml
НАШЕ (на разбор)$IMPORTS\youtube\_test_takeout_pull.py(set GMAIL_DIR= or check the node's connector)
НАШЕ (на разбор)$IMPORTS\compress\_test_ccr.pyИТОГ: 17 ✅ / 0 ❌