⌂ все дашборды/Прочее← Maintainer-Relations · Nightly-Bugs-MyOwnPC-Natalia →
Ночной санитар A-2022BAYAREA

Ночной санитар -- A-2022BAYAREA

машина A-2022BAYAREA -- собрано 2026-09-14 05:28 -- разбор: НЕ выполнен

174НАШЕ (на разбор)
4ЖДЁТ ХАБА (файл не доехал)
1119ОКРУЖЕНИЕ (нет пакета)
1ЧУЖОЕ (другая машина/ОС)
класстестпоследняя строка
НАШЕ (на разбор)~\.claude\hooks\_test_computer_use_grant.pyFAILED: в базе нет мёртвых путей
НАШЕ (на разбор)~\.claude\hooks\_test_hooks.py10 passed, 3 failed
НАШЕ (на разбор)~\.claude\scripts\_shared\_test_chrome_login_shield.py- cookiedb-new-preferred: got False want True
ЧУЖОЕ (другая машина/ОС)~\.claude\scripts\_shared\_test_claude_fleet.py❌ ПРОВАЛЕНО 1: 10e обёртки .sh переносимы (без /Users/anton)
НАШЕ (на разбор)~\.claude\scripts\_shared\_test_consensus_s10.py68/69 PASSED <-- FAILURES ABOVE
НАШЕ (на разбор)~\.claude\scripts\_shared\_test_machine_bus.py== ИТОГ: 31 PASS, 1 FAIL ==
НАШЕ (на разбор)~\.claude\scripts\_shared\_test_output_freshness.pySOME FAILED (1 failures)
НАШЕ (на разбор)~\.claude\scripts\_shared\rule_liveness.pyИТОГО: 17 PASS, 1 FAIL
НАШЕ (на разбор)~\.claude\scripts\_test_ask_once_wiring.py3 FAILED: publish_canon x4 -> добавился РОВНО 1 аск (итого 2); claude_md_guard x3 (streak 2/3/4) -> РОВНО 1 ас
ЖДЁТ ХАБА (файл не доехал)~\.claude\scripts\_test_brno_guides_watch.pyFileNotFoundError: [WinError 2] The system cannot find the file specified
НАШЕ (на разбор)~\.claude\scripts\_test_claude_fleet_stage.pyКРАСНОЕ (4 из 7): НОВЫЙ движок попал в канал, НОВЫЙ скилл попал в канал, паспорт из scripts/docs попал, cwd бо
НАШЕ (на разбор)~\.claude\scripts\_test_clone_gate_fanout_leg.pyFAIL: гейт отбил ПЛЕЧО ВЕЕРА ДР (DR_FANOUT_RAIL) -- кворум недостижим
НАШЕ (на разбор)~\.claude\scripts\_test_consensus_s10.py68/69 PASSED <-- FAILURES ABOVE
НАШЕ (на разбор)~\.claude\scripts\_test_deploy_apply_timeout.pyRED: 1 провал(ов): бэкап старого кода на месте (иначе красноту не показать)
НАШЕ (на разбор)~\.claude\scripts\_test_deploy_cargo.py- case_sender_alert:exception
НАШЕ (на разбор)~\.claude\scripts\_test_deploy_me_bare_env.pyКРАСНЫХ: 3 -> ['canon_key срезает .local', 'canon_key срезает .lan', 'в лесенке ME есть ступень machine.env (m
НАШЕ (на разбор)~\.claude\scripts\_test_dr_ff_rail_ready.pyКРАСНО
НАШЕ (на разбор)~\.claude\scripts\_test_dr_leg_gate_no_search.py- (2) живая улика chatgpt.md прошла гейт: exit=0, вывод: [dr-leg] ✅ chatgpt.md -- лега годная, можно co
НАШЕ (на разбор)~\.claude\scripts\_test_dr_rails_body_door.pyFAIL: MACHINE_BUS_DIR задан, а шину ищем в волте — это двойник шины
НАШЕ (на разбор)~\.claude\scripts\_test_dr_start.py- каждая тема уцелела в реестре:
НАШЕ (на разбор)~\.claude\scripts\_test_fleet_routines_verdicts.py❌ КРАСНЫЙ: 1 проверок упало: ['покрыты все 4 породы запускальщика']
НАШЕ (на разбор)~\.claude\scripts\_test_github_routines_registry.pyКРАСНОЕ: свежий лейн со ссылкой = 🟢
НАШЕ (на разбор)~\.claude\scripts\_test_help_flag_lint.pyупали: D1 новых дыр во флоте нет (exit 0)
НАШЕ (на разбор)~\.claude\scripts\_test_hook_roster_substr.pyПодробности построчно: python ~/.claude/scripts/substr_lint.py --roster
НАШЕ (на разбор)~\.claude\scripts\_test_install_doi_reach.pyRED — 2 провалов: аудит с --ping -> verify говорит ДА, узел без cron -> verify не врёт красным
НАШЕ (на разбор)~\.claude\scripts\_test_installer_python_literal.pyЛечи: sys.executable (свой запуск) или платформенная развилка (запись в settings/планировщик).
НАШЕ (на разбор)~\.claude\scripts\_test_journal_scan.py✗ следующий прогон доводит остаток
НАШЕ (на разбор)~\.claude\scripts\_test_limit_reaper.pyИТОГ: ❌ жнец опасен
НАШЕ (на разбор)~\.claude\scripts\_test_machine_key_bare_env_gate.py❌ B2 ноль голых чтений MACHINE_KEY без лестницы нарушители: fleet_sheet_registry_push.py, limit_reaper.py, _sh
ЖДЁТ ХАБА (файл не доехал)~\.claude\scripts\_test_memory_tidy.pyFileNotFoundError: [WinError 2] The system cannot find the file specified
ЖДЁТ ХАБА (файл не доехал)~\.claude\scripts\_test_prompt_panel.pyFileNotFoundError: [Errno 2] No such file or directory: 'C:\\Users\\Anton\\.claude\\scripts\\prompt_panel_quer
НАШЕ (на разбор)~\.claude\scripts\_test_pulse_mirror_level0.pyAttributeError: module 'pulse_mirror' has no attribute 'MIRROR_NOW'
НАШЕ (на разбор)~\.claude\scripts\_test_robot_watchdog.pyx T7 preflight on real creds -> healthy
НАШЕ (на разбор)~\.claude\scripts\_test_routine_probe_truth.pyAttributeError: module 'rrc' has no attribute 'known_outputs'
НАШЕ (на разбор)~\.claude\scripts\_test_scripts_share.pyTimeoutError: timed out
НАШЕ (на разбор)~\.claude\scripts\_test_secret_broker.pyИТОГ: 20/21 OK · брокер: C:\Users\Anton\.claude\scripts\secret_broker.py
НАШЕ (на разбор)~\.claude\scripts\_test_seed_vs_scheduler.pyКРАСНЫХ: 2 -> ['детектор ЛОВИТ реальный текст переезда 24.08', 'детектор ловит и парный лейн git-s7-vendor']
НАШЕ (на разбор)~\.claude\scripts\_test_selfheal_card_dedup.pyитог: 3 ok, 2 fail
НАШЕ (на разбор)~\.claude\scripts\_test_session_alpha_mine.pySELFTEST FAIL
НАШЕ (на разбор)~\.claude\scripts\_test_signal_map.py2 FAILED: старая копия карты не разошлась с живой; нет бесхозных красных задач (≥3 дня эскалаций без карты и б
НАШЕ (на разбор)~\.claude\scripts\_test_skill_refs.pytt: НЕТ ДВИЖКА -> test.py
НАШЕ (на разбор)~\.claude\scripts\_test_spawn_ladder.py❌ ПРОВАЛОВ: 2
НАШЕ (на разбор)~\.claude\scripts\_test_spawn_slot_guard.py❌ провалов: 4 из 21
НАШЕ (на разбор)~\.claude\scripts\_test_tier1_needs_cmd_apply.pyFAILED: 2 -- T4 машинные apply+verify при --tier 1 проходят, T10 известный узел по-прежнему регистрируется
НАШЕ (на разбор)~\.claude\scripts\_test_tool_doors.pyFAILED: T6, T7
НАШЕ (на разбор)~\.claude\scripts\_test_verify_sweep.pyAttributeError: module 'deploy_lib' has no attribute 'verify_predates_parcel'
НАШЕ (на разбор)~\.claude\scripts\_test_wa_broker_watch.py- в докладе не назван лежащий аккаунт: taskkill /F /PID 11
НАШЕ (на разбор)~\.claude\scripts\_test_zenodo_deposit.pyFAILED (failures=2)
НАШЕ (на разбор)~\.claude\scripts\files\_test_browser_usage_log.pyjson.decoder.JSONDecodeError: Expecting value: line 1 column 1 (char 0)
ЖДЁТ ХАБА (файл не доехал)~\.claude\scripts\prompt_panel.pyFileNotFoundError: [Errno 2] No such file or directory: 'C:\\Users\\Anton\\.claude\\scripts\\prompt_panel_quer
НАШЕ (на разбор)~\.claude\scripts\test_approval_db_concurrency.py3 failed, 4 passed in 3.68s
НАШЕ (на разбор)~\.claude\scripts\test_delegate_no_vacuous_green.py7 failed in 0.55s
НАШЕ (на разбор)$IMPORTS\_test_build_bible_moc.pyRED: секция Прочее не разрослась
НАШЕ (на разбор)$IMPORTS\_test_dr_fact_lint.pyFAILS (1): no ✅ for the fabricated ref
НАШЕ (на разбор)$IMPORTS\alpha\_test_alpha_route.pyRED: 2 fail(s): credits=1 (малформ скипнут), rerun: подпроцессов 0
НАШЕ (на разбор)$IMPORTS\arch\_test_sys_scan_disabled.pySOME FAILED (2 failures)
НАШЕ (на разбор)$IMPORTS\chatgpt\_test_chatgpt_accounts.pyRESULT: 28 ok, 1 FAILED -> в реестре НЕТ значений-токенов
НАШЕ (на разбор)$IMPORTS\crm-engine\_test_doping_channels.pyAssertionError: {'handle': 'tg-lead', 'action': 'error', 'why': 'AttributeError("\'_FakeTg\' object has no att
НАШЕ (на разбор)$IMPORTS\cv-events\_test_cv_dates.pyсверка дат: отсеяно прошедших событий: 190
ОКРУЖЕНИЕ (нет пакета)$IMPORTS\goblin-corpus\train\venv\Lib\site-packages\accelerate\test_utils\scripts\external_deps\test_checkpointing.pyModuleNotFoundError: No module named 'evaluate'
ОКРУЖЕНИЕ (нет пакета)$IMPORTS\goblin-corpus\train\venv\Lib\site-packages\accelerate\test_utils\scripts\external_deps\test_ds_alst_ulysses_sp.pyModuleNotFoundError: No module named 'deepspeed'
ОКРУЖЕНИЕ (нет пакета)$IMPORTS\goblin-corpus\train\venv\Lib\site-packages\accelerate\test_utils\scripts\external_deps\test_ds_multiple_model.pyModuleNotFoundError: No module named 'evaluate'
ОКРУЖЕНИЕ (нет пакета)$IMPORTS\goblin-corpus\train\venv\Lib\site-packages\accelerate\test_utils\scripts\external_deps\test_metrics.pyModuleNotFoundError: No module named 'datasets'
ОКРУЖЕНИЕ (нет пакета)$IMPORTS\goblin-corpus\train\venv\Lib\site-packages\accelerate\test_utils\scripts\external_deps\test_peak_memory_usage.pyModuleNotFoundError: No module named 'datasets'
ОКРУЖЕНИЕ (нет пакета)$IMPORTS\goblin-corpus\train\venv\Lib\site-packages\accelerate\test_utils\scripts\external_deps\test_performance.pyModuleNotFoundError: No module named 'evaluate'
ОКРУЖЕНИЕ (нет пакета)$IMPORTS\goblin-corpus\train\venv\Lib\site-packages\accelerate\test_utils\scripts\external_deps\test_pippy.pyModuleNotFoundError: No module named 'accelerate'
ОКРУЖЕНИЕ (нет пакета)$IMPORTS\goblin-corpus\train\venv\Lib\site-packages\accelerate\test_utils\scripts\external_deps\test_zero3_integration.pyModuleNotFoundError: No module named 'accelerate'
ОКРУЖЕНИЕ (нет пакета)$IMPORTS\goblin-corpus\train\venv\Lib\site-packages\accelerate\test_utils\scripts\test_cli.pyModuleNotFoundError: No module named 'accelerate'
ОКРУЖЕНИЕ (нет пакета)$IMPORTS\goblin-corpus\train\venv\Lib\site-packages\accelerate\test_utils\scripts\test_ddp_comm_hook.pyModuleNotFoundError: No module named 'accelerate'
ОКРУЖЕНИЕ (нет пакета)$IMPORTS\goblin-corpus\train\venv\Lib\site-packages\accelerate\test_utils\scripts\test_distributed_data_loop.pyModuleNotFoundError: No module named 'accelerate'
ОКРУЖЕНИЕ (нет пакета)$IMPORTS\goblin-corpus\train\venv\Lib\site-packages\accelerate\test_utils\scripts\test_merge_weights.pyModuleNotFoundError: No module named 'accelerate'
ОКРУЖЕНИЕ (нет пакета)$IMPORTS\goblin-corpus\train\venv\Lib\site-packages\accelerate\test_utils\scripts\test_notebook.pyModuleNotFoundError: No module named 'accelerate'
ОКРУЖЕНИЕ (нет пакета)$IMPORTS\goblin-corpus\train\venv\Lib\site-packages\accelerate\test_utils\scripts\test_ops.pyModuleNotFoundError: No module named 'accelerate'
ОКРУЖЕНИЕ (нет пакета)$IMPORTS\goblin-corpus\train\venv\Lib\site-packages\accelerate\test_utils\scripts\test_script.pyModuleNotFoundError: No module named 'accelerate'
ОКРУЖЕНИЕ (нет пакета)$IMPORTS\goblin-corpus\train\venv\Lib\site-packages\accelerate\test_utils\scripts\test_sync.pyModuleNotFoundError: No module named 'accelerate'
НАШЕ (на разбор)$IMPORTS\goblin-corpus\train\venv\Lib\site-packages\aiohttp\test_utils.pyImportError: cannot import name 'HTTPStatus' from partially initialized module 'http' (most likely due to a ci
ОКРУЖЕНИЕ (нет пакета)$IMPORTS\goblin-corpus\train\venv\Lib\site-packages\dill\tests\test_abc.pyModuleNotFoundError: No module named 'dill'
ОКРУЖЕНИЕ (нет пакета)$IMPORTS\goblin-corpus\train\venv\Lib\site-packages\dill\tests\test_check.pyModuleNotFoundError: No module named 'dill'
ОКРУЖЕНИЕ (нет пакета)$IMPORTS\goblin-corpus\train\venv\Lib\site-packages\dill\tests\test_classdef.pyModuleNotFoundError: No module named 'dill'
ОКРУЖЕНИЕ (нет пакета)$IMPORTS\goblin-corpus\train\venv\Lib\site-packages\dill\tests\test_dataclasses.pyModuleNotFoundError: No module named 'dill'
ОКРУЖЕНИЕ (нет пакета)$IMPORTS\goblin-corpus\train\venv\Lib\site-packages\dill\tests\test_detect.pyModuleNotFoundError: No module named 'dill'
ОКРУЖЕНИЕ (нет пакета)$IMPORTS\goblin-corpus\train\venv\Lib\site-packages\dill\tests\test_dictviews.pyModuleNotFoundError: No module named 'dill'
ОКРУЖЕНИЕ (нет пакета)$IMPORTS\goblin-corpus\train\venv\Lib\site-packages\dill\tests\test_diff.pyModuleNotFoundError: No module named 'dill'
ОКРУЖЕНИЕ (нет пакета)$IMPORTS\goblin-corpus\train\venv\Lib\site-packages\dill\tests\test_extendpickle.pyModuleNotFoundError: No module named 'dill'
ОКРУЖЕНИЕ (нет пакета)$IMPORTS\goblin-corpus\train\venv\Lib\site-packages\dill\tests\test_fglobals.pyModuleNotFoundError: No module named 'dill'
ОКРУЖЕНИЕ (нет пакета)$IMPORTS\goblin-corpus\train\venv\Lib\site-packages\dill\tests\test_file.pyModuleNotFoundError: No module named 'dill'
ОКРУЖЕНИЕ (нет пакета)$IMPORTS\goblin-corpus\train\venv\Lib\site-packages\dill\tests\test_functions.pyModuleNotFoundError: No module named 'dill'
ОКРУЖЕНИЕ (нет пакета)$IMPORTS\goblin-corpus\train\venv\Lib\site-packages\dill\tests\test_functors.pyModuleNotFoundError: No module named 'dill'
ОКРУЖЕНИЕ (нет пакета)$IMPORTS\goblin-corpus\train\venv\Lib\site-packages\dill\tests\test_logger.pyModuleNotFoundError: No module named 'dill'
ОКРУЖЕНИЕ (нет пакета)$IMPORTS\goblin-corpus\train\venv\Lib\site-packages\dill\tests\test_mixins.pyModuleNotFoundError: No module named 'dill'
ОКРУЖЕНИЕ (нет пакета)$IMPORTS\goblin-corpus\train\venv\Lib\site-packages\dill\tests\test_module.pyModuleNotFoundError: No module named 'dill'
ОКРУЖЕНИЕ (нет пакета)$IMPORTS\goblin-corpus\train\venv\Lib\site-packages\dill\tests\test_moduledict.pyModuleNotFoundError: No module named 'dill'
ОКРУЖЕНИЕ (нет пакета)$IMPORTS\goblin-corpus\train\venv\Lib\site-packages\dill\tests\test_nested.pyModuleNotFoundError: No module named 'dill'
ОКРУЖЕНИЕ (нет пакета)$IMPORTS\goblin-corpus\train\venv\Lib\site-packages\dill\tests\test_objects.pyModuleNotFoundError: No module named 'dill'
ОКРУЖЕНИЕ (нет пакета)$IMPORTS\goblin-corpus\train\venv\Lib\site-packages\dill\tests\test_properties.pyModuleNotFoundError: No module named 'dill'
ОКРУЖЕНИЕ (нет пакета)$IMPORTS\goblin-corpus\train\venv\Lib\site-packages\dill\tests\test_pycapsule.pyModuleNotFoundError: No module named 'dill'
ОКРУЖЕНИЕ (нет пакета)$IMPORTS\goblin-corpus\train\venv\Lib\site-packages\dill\tests\test_recursive.pyModuleNotFoundError: No module named 'dill'
ОКРУЖЕНИЕ (нет пакета)$IMPORTS\goblin-corpus\train\venv\Lib\site-packages\dill\tests\test_registered.pyModuleNotFoundError: No module named 'dill'
ОКРУЖЕНИЕ (нет пакета)$IMPORTS\goblin-corpus\train\venv\Lib\site-packages\dill\tests\test_restricted.pyModuleNotFoundError: No module named 'dill'
ОКРУЖЕНИЕ (нет пакета)$IMPORTS\goblin-corpus\train\venv\Lib\site-packages\dill\tests\test_selected.pyModuleNotFoundError: No module named 'dill'
ОКРУЖЕНИЕ (нет пакета)$IMPORTS\goblin-corpus\train\venv\Lib\site-packages\dill\tests\test_session.pyModuleNotFoundError: No module named 'dill'
ОКРУЖЕНИЕ (нет пакета)$IMPORTS\goblin-corpus\train\venv\Lib\site-packages\dill\tests\test_source.pyModuleNotFoundError: No module named 'dill'
ОКРУЖЕНИЕ (нет пакета)$IMPORTS\goblin-corpus\train\venv\Lib\site-packages\dill\tests\test_sources.pyModuleNotFoundError: No module named 'dill'
ОКРУЖЕНИЕ (нет пакета)$IMPORTS\goblin-corpus\train\venv\Lib\site-packages\dill\tests\test_temp.pyModuleNotFoundError: No module named 'dill'
ОКРУЖЕНИЕ (нет пакета)$IMPORTS\goblin-corpus\train\venv\Lib\site-packages\dill\tests\test_threads.pyModuleNotFoundError: No module named 'dill'
ОКРУЖЕНИЕ (нет пакета)$IMPORTS\goblin-corpus\train\venv\Lib\site-packages\dill\tests\test_weakref.pyModuleNotFoundError: No module named 'dill'
ОКРУЖЕНИЕ (нет пакета)$IMPORTS\goblin-corpus\train\venv\Lib\site-packages\multiprocess\tests\test_multiprocessing_fork\test_manager.pyModuleNotFoundError: No module named 'multiprocess'
ОКРУЖЕНИЕ (нет пакета)$IMPORTS\goblin-corpus\train\venv\Lib\site-packages\multiprocess\tests\test_multiprocessing_fork\test_misc.pyModuleNotFoundError: No module named 'multiprocess'
ОКРУЖЕНИЕ (нет пакета)$IMPORTS\goblin-corpus\train\venv\Lib\site-packages\multiprocess\tests\test_multiprocessing_fork\test_processes.pyModuleNotFoundError: No module named 'multiprocess'
ОКРУЖЕНИЕ (нет пакета)$IMPORTS\goblin-corpus\train\venv\Lib\site-packages\multiprocess\tests\test_multiprocessing_fork\test_threads.pyModuleNotFoundError: No module named 'multiprocess'
ОКРУЖЕНИЕ (нет пакета)$IMPORTS\goblin-corpus\train\venv\Lib\site-packages\multiprocess\tests\test_multiprocessing_forkserver\test_manager.pyModuleNotFoundError: No module named 'multiprocess'
ОКРУЖЕНИЕ (нет пакета)$IMPORTS\goblin-corpus\train\venv\Lib\site-packages\multiprocess\tests\test_multiprocessing_forkserver\test_misc.pyModuleNotFoundError: No module named 'multiprocess'
ОКРУЖЕНИЕ (нет пакета)$IMPORTS\goblin-corpus\train\venv\Lib\site-packages\multiprocess\tests\test_multiprocessing_forkserver\test_processes.pyModuleNotFoundError: No module named 'multiprocess'
ОКРУЖЕНИЕ (нет пакета)$IMPORTS\goblin-corpus\train\venv\Lib\site-packages\multiprocess\tests\test_multiprocessing_forkserver\test_threads.pyModuleNotFoundError: No module named 'multiprocess'
ОКРУЖЕНИЕ (нет пакета)$IMPORTS\goblin-corpus\train\venv\Lib\site-packages\multiprocess\tests\test_multiprocessing_main_handling.pyModuleNotFoundError: No module named 'multiprocess'
ОКРУЖЕНИЕ (нет пакета)$IMPORTS\goblin-corpus\train\venv\Lib\site-packages\multiprocess\tests\test_multiprocessing_spawn\test_manager.pyModuleNotFoundError: No module named 'multiprocess'
ОКРУЖЕНИЕ (нет пакета)$IMPORTS\goblin-corpus\train\venv\Lib\site-packages\multiprocess\tests\test_multiprocessing_spawn\test_misc.pyModuleNotFoundError: No module named 'multiprocess'
ОКРУЖЕНИЕ (нет пакета)$IMPORTS\goblin-corpus\train\venv\Lib\site-packages\multiprocess\tests\test_multiprocessing_spawn\test_processes.pyModuleNotFoundError: No module named 'multiprocess'
ОКРУЖЕНИЕ (нет пакета)$IMPORTS\goblin-corpus\train\venv\Lib\site-packages\multiprocess\tests\test_multiprocessing_spawn\test_threads.pyModuleNotFoundError: No module named 'multiprocess'
НАШЕ (на разбор)$IMPORTS\goblin-corpus\train\venv\Lib\site-packages\networkx\algorithms\assortativity\tests\test_correlation.pyImportError: attempted relative import with no known parent package
НАШЕ (на разбор)$IMPORTS\goblin-corpus\train\venv\Lib\site-packages\networkx\algorithms\assortativity\tests\test_mixing.pyImportError: attempted relative import with no known parent package
НАШЕ (на разбор)$IMPORTS\goblin-corpus\train\venv\Lib\site-packages\networkx\algorithms\assortativity\tests\test_pairs.pyImportError: attempted relative import with no known parent package
НАШЕ (на разбор)$IMPORTS\goblin-corpus\train\venv\Lib\site-packages\networkx\algorithms\bipartite\tests\test_generators.pyImportError: attempted relative import with no known parent package
ОКРУЖЕНИЕ (нет пакета)$IMPORTS\goblin-corpus\train\venv\Lib\site-packages\networkx\algorithms\centrality\tests\test_group.pySkipped: could not import 'pandas': No module named 'pandas'
НАШЕ (на разбор)$IMPORTS\goblin-corpus\train\venv\Lib\site-packages\networkx\classes\tests\test_digraph.pyImportError: attempted relative import with no known parent package
НАШЕ (на разбор)$IMPORTS\goblin-corpus\train\venv\Lib\site-packages\networkx\classes\tests\test_digraph_historical.pyImportError: attempted relative import with no known parent package
НАШЕ (на разбор)$IMPORTS\goblin-corpus\train\venv\Lib\site-packages\networkx\classes\tests\test_graph_historical.pyImportError: attempted relative import with no known parent package
НАШЕ (на разбор)$IMPORTS\goblin-corpus\train\venv\Lib\site-packages\networkx\classes\tests\test_multidigraph.pyImportError: attempted relative import with no known parent package
НАШЕ (на разбор)$IMPORTS\goblin-corpus\train\venv\Lib\site-packages\networkx\classes\tests\test_multigraph.pyImportError: attempted relative import with no known parent package
НАШЕ (на разбор)$IMPORTS\goblin-corpus\train\venv\Lib\site-packages\networkx\classes\tests\test_special.pyImportError: attempted relative import with no known parent package
ОКРУЖЕНИЕ (нет пакета)$IMPORTS\goblin-corpus\train\venv\Lib\site-packages\networkx\drawing\tests\test_agraph.pySkipped: could not import 'pygraphviz': No module named 'pygraphviz'
ОКРУЖЕНИЕ (нет пакета)$IMPORTS\goblin-corpus\train\venv\Lib\site-packages\networkx\drawing\tests\test_image_comparison_pylab_mpl.pySkipped: could not import 'pytest_mpl': No module named 'pytest_mpl'
ОКРУЖЕНИЕ (нет пакета)$IMPORTS\goblin-corpus\train\venv\Lib\site-packages\networkx\drawing\tests\test_pydot.pySkipped: could not import 'pydot': No module named 'pydot'
ОКРУЖЕНИЕ (нет пакета)$IMPORTS\goblin-corpus\train\venv\Lib\site-packages\networkx\drawing\tests\test_pylab.pySkipped: could not import 'matplotlib': No module named 'matplotlib'
ОКРУЖЕНИЕ (нет пакета)$IMPORTS\goblin-corpus\train\venv\Lib\site-packages\networkx\tests\test_convert_pandas.pySkipped: could not import 'pandas': No module named 'pandas'
НАШЕ (на разбор)$IMPORTS\goblin-corpus\train\venv\Lib\site-packages\numpy\_core\tests\test_api.pyImportError: cannot import name 'rational2' from 'numpy._core._rational_tests' (C:\Users\Anton\AppData\Local\P
НАШЕ (на разбор)$IMPORTS\goblin-corpus\train\venv\Lib\site-packages\numpy\_core\tests\test_array_coercion.pyImportError: cannot import name 'rational2' from 'numpy._core._rational_tests' (C:\Users\Anton\AppData\Local\P
НАШЕ (на разбор)$IMPORTS\goblin-corpus\train\venv\Lib\site-packages\numpy\_core\tests\test_arrayobject.pyImportError: cannot import name 'rational2' from 'numpy._core._rational_tests' (C:\Users\Anton\AppData\Local\P
ОКРУЖЕНИЕ (нет пакета)$IMPORTS\goblin-corpus\train\venv\Lib\site-packages\numpy\_core\tests\test_arrayprint.pyModuleNotFoundError: No module named 'hypothesis'
НАШЕ (на разбор)$IMPORTS\goblin-corpus\train\venv\Lib\site-packages\numpy\_core\tests\test_cython.pyImportError: cannot import name 'run_subprocess' from 'numpy.testing._private.utils' (C:\Users\Anton\AppData\L
ОКРУЖЕНИЕ (нет пакета)$IMPORTS\goblin-corpus\train\venv\Lib\site-packages\numpy\_core\tests\test_dtype.pyModuleNotFoundError: No module named 'hypothesis'
НАШЕ (на разбор)$IMPORTS\goblin-corpus\train\venv\Lib\site-packages\numpy\_core\tests\test_hashtable.pyImportError: cannot import name 'create_identity_hash' from 'numpy._core._multiarray_tests' (C:\Users\Anton\Ap
НАШЕ (на разбор)$IMPORTS\goblin-corpus\train\venv\Lib\site-packages\numpy\_core\tests\test_limited_api.pyImportError: cannot import name 'run_subprocess' from 'numpy.testing._private.utils' (C:\Users\Anton\AppData\L
НАШЕ (на разбор)$IMPORTS\goblin-corpus\train\venv\Lib\site-packages\numpy\_core\tests\test_multiarray.pyImportError: cannot import name 'rational2' from 'numpy._core._rational_tests' (C:\Users\Anton\AppData\Local\P
НАШЕ (на разбор)$IMPORTS\goblin-corpus\train\venv\Lib\site-packages\numpy\_core\tests\test_multithreading.pyImportError: cannot import name 'run_subprocess' from 'numpy.testing._private.utils' (C:\Users\Anton\AppData\L
ОКРУЖЕНИЕ (нет пакета)$IMPORTS\goblin-corpus\train\venv\Lib\site-packages\numpy\_core\tests\test_nep50_promotions.pyModuleNotFoundError: No module named 'hypothesis'
ОКРУЖЕНИЕ (нет пакета)$IMPORTS\goblin-corpus\train\venv\Lib\site-packages\numpy\_core\tests\test_numeric.pyModuleNotFoundError: No module named 'hypothesis'
НАШЕ (на разбор)$IMPORTS\goblin-corpus\train\venv\Lib\site-packages\numpy\_core\tests\test_regression.pyImportError: cannot import name 'requires_deep_recursion' from 'numpy.testing._private.utils' (C:\Users\Anton\
НАШЕ (на разбор)$IMPORTS\goblin-corpus\train\venv\Lib\site-packages\numpy\_core\tests\test_scalar_methods.pyImportError: cannot import name 'LONG_DOUBLE_IS_IBM_DOUBLE_DOUBLE' from 'numpy.testing._private.utils' (C:\Use
НАШЕ (на разбор)$IMPORTS\goblin-corpus\train\venv\Lib\site-packages\numpy\_core\tests\test_scalarbuffer.pyImportError: cannot import name 'rational2' from 'numpy._core._rational_tests' (C:\Users\Anton\AppData\Local\P
ОКРУЖЕНИЕ (нет пакета)$IMPORTS\goblin-corpus\train\venv\Lib\site-packages\numpy\_core\tests\test_scalarmath.pyModuleNotFoundError: No module named 'hypothesis'
НАШЕ (на разбор)$IMPORTS\goblin-corpus\train\venv\Lib\site-packages\numpy\_core\tests\test_scalarprint.pyImportError: cannot import name 'LONG_DOUBLE_IS_IBM_DOUBLE_DOUBLE' from 'numpy.testing._private.utils' (C:\Use
НАШЕ (на разбор)$IMPORTS\goblin-corpus\train\venv\Lib\site-packages\numpy\_core\tests\test_ufunc.pyAttributeError: module 'numpy._core._rational_tests' has no attribute 'rational2'. Did you mean: 'rational'?
НАШЕ (на разбор)$IMPORTS\goblin-corpus\train\venv\Lib\site-packages\numpy\_core\tests\test_umath.pyImportError: cannot import name 'LONG_DOUBLE_IS_IBM_DOUBLE_DOUBLE' from 'numpy.testing._private.utils' (C:\Use
НАШЕ (на разбор)$IMPORTS\goblin-corpus\train\venv\Lib\site-packages\numpy\f2py\tests\test_abstract_interface.pyImportError: attempted relative import with no known parent package
НАШЕ (на разбор)$IMPORTS\goblin-corpus\train\venv\Lib\site-packages\numpy\f2py\tests\test_array_from_pyobj.pyImportError: attempted relative import with no known parent package
НАШЕ (на разбор)$IMPORTS\goblin-corpus\train\venv\Lib\site-packages\numpy\f2py\tests\test_assumed_shape.pyImportError: attempted relative import with no known parent package
НАШЕ (на разбор)$IMPORTS\goblin-corpus\train\venv\Lib\site-packages\numpy\f2py\tests\test_block_docstring.pyImportError: attempted relative import with no known parent package
НАШЕ (на разбор)$IMPORTS\goblin-corpus\train\venv\Lib\site-packages\numpy\f2py\tests\test_callback.pyImportError: attempted relative import with no known parent package
НАШЕ (на разбор)$IMPORTS\goblin-corpus\train\venv\Lib\site-packages\numpy\f2py\tests\test_character.pySkipped: No Fortran tests on Windows (Issue #25134)
НАШЕ (на разбор)$IMPORTS\goblin-corpus\train\venv\Lib\site-packages\numpy\f2py\tests\test_common.pyImportError: attempted relative import with no known parent package
НАШЕ (на разбор)$IMPORTS\goblin-corpus\train\venv\Lib\site-packages\numpy\f2py\tests\test_crackfortran.pyImportError: attempted relative import with no known parent package
НАШЕ (на разбор)$IMPORTS\goblin-corpus\train\venv\Lib\site-packages\numpy\f2py\tests\test_data.pyImportError: attempted relative import with no known parent package
НАШЕ (на разбор)$IMPORTS\goblin-corpus\train\venv\Lib\site-packages\numpy\f2py\tests\test_docs.pyImportError: attempted relative import with no known parent package
НАШЕ (на разбор)$IMPORTS\goblin-corpus\train\venv\Lib\site-packages\numpy\f2py\tests\test_f2cmap.pyImportError: attempted relative import with no known parent package
НАШЕ (на разбор)$IMPORTS\goblin-corpus\train\venv\Lib\site-packages\numpy\f2py\tests\test_f2py2e.pyImportError: attempted relative import with no known parent package
НАШЕ (на разбор)$IMPORTS\goblin-corpus\train\venv\Lib\site-packages\numpy\f2py\tests\test_inplace.pySkipped: No Fortran tests on Windows (Issue #25134)
НАШЕ (на разбор)$IMPORTS\goblin-corpus\train\venv\Lib\site-packages\numpy\f2py\tests\test_isoc.pyImportError: attempted relative import with no known parent package
НАШЕ (на разбор)$IMPORTS\goblin-corpus\train\venv\Lib\site-packages\numpy\f2py\tests\test_kind.pyImportError: attempted relative import with no known parent package
НАШЕ (на разбор)$IMPORTS\goblin-corpus\train\venv\Lib\site-packages\numpy\f2py\tests\test_mixed.pyImportError: attempted relative import with no known parent package
НАШЕ (на разбор)$IMPORTS\goblin-corpus\train\venv\Lib\site-packages\numpy\f2py\tests\test_modules.pyImportError: attempted relative import with no known parent package
НАШЕ (на разбор)$IMPORTS\goblin-corpus\train\venv\Lib\site-packages\numpy\f2py\tests\test_parameter.pyImportError: attempted relative import with no known parent package
НАШЕ (на разбор)$IMPORTS\goblin-corpus\train\venv\Lib\site-packages\numpy\f2py\tests\test_quoted_character.pyImportError: attempted relative import with no known parent package
НАШЕ (на разбор)$IMPORTS\goblin-corpus\train\venv\Lib\site-packages\numpy\f2py\tests\test_regression.pyImportError: attempted relative import with no known parent package
НАШЕ (на разбор)$IMPORTS\goblin-corpus\train\venv\Lib\site-packages\numpy\f2py\tests\test_return_character.pyImportError: attempted relative import with no known parent package
НАШЕ (на разбор)$IMPORTS\goblin-corpus\train\venv\Lib\site-packages\numpy\f2py\tests\test_return_complex.pyImportError: attempted relative import with no known parent package
НАШЕ (на разбор)$IMPORTS\goblin-corpus\train\venv\Lib\site-packages\numpy\f2py\tests\test_return_integer.pyImportError: attempted relative import with no known parent package
НАШЕ (на разбор)$IMPORTS\goblin-corpus\train\venv\Lib\site-packages\numpy\f2py\tests\test_return_logical.pyImportError: attempted relative import with no known parent package
НАШЕ (на разбор)$IMPORTS\goblin-corpus\train\venv\Lib\site-packages\numpy\f2py\tests\test_return_real.pyImportError: attempted relative import with no known parent package
НАШЕ (на разбор)$IMPORTS\goblin-corpus\train\venv\Lib\site-packages\numpy\f2py\tests\test_routines.pyImportError: attempted relative import with no known parent package
НАШЕ (на разбор)$IMPORTS\goblin-corpus\train\venv\Lib\site-packages\numpy\f2py\tests\test_semicolon_split.pyImportError: attempted relative import with no known parent package
НАШЕ (на разбор)$IMPORTS\goblin-corpus\train\venv\Lib\site-packages\numpy\f2py\tests\test_size.pyImportError: attempted relative import with no known parent package
НАШЕ (на разбор)$IMPORTS\goblin-corpus\train\venv\Lib\site-packages\numpy\f2py\tests\test_string.pyImportError: attempted relative import with no known parent package
НАШЕ (на разбор)$IMPORTS\goblin-corpus\train\venv\Lib\site-packages\numpy\f2py\tests\test_symbolic.pyImportError: attempted relative import with no known parent package
НАШЕ (на разбор)$IMPORTS\goblin-corpus\train\venv\Lib\site-packages\numpy\f2py\tests\test_value_attrspec.pyImportError: attempted relative import with no known parent package
ОКРУЖЕНИЕ (нет пакета)$IMPORTS\goblin-corpus\train\venv\Lib\site-packages\numpy\lib\tests\test_function_base.pyModuleNotFoundError: No module named 'hypothesis'
НАШЕ (на разбор)$IMPORTS\goblin-corpus\train\venv\Lib\site-packages\numpy\lib\tests\test_stride_tricks.pyImportError: cannot import name 'rational2' from 'numpy._core._rational_tests' (C:\Users\Anton\AppData\Local\P
НАШЕ (на разбор)$IMPORTS\goblin-corpus\train\venv\Lib\site-packages\numpy\linalg\tests\test_linalg.pyImportError: cannot import name 'run_subprocess' from 'numpy.testing._private.utils' (C:\Users\Anton\AppData\L
НАШЕ (на разбор)$IMPORTS\goblin-corpus\train\venv\Lib\site-packages\numpy\random\tests\test_extending.pyImportError: cannot import name 'run_subprocess' from 'numpy.testing._private.utils' (C:\Users\Anton\AppData\L
НАШЕ (на разбор)$IMPORTS\goblin-corpus\train\venv\Lib\site-packages\numpy\tests\test_ctypeslib.pyAttributeError: module 'numpy._core' has no attribute '_multiarray_tests'. Did you mean: '_multiarray_umath'?
НАШЕ (на разбор)$IMPORTS\goblin-corpus\train\venv\Lib\site-packages\numpy\tests\test_lazyloading.pyImportError: cannot import name 'run_subprocess' from 'numpy.testing._private.utils' (C:\Users\Anton\AppData\L
НАШЕ (на разбор)$IMPORTS\goblin-corpus\train\venv\Lib\site-packages\numpy\tests\test_public_api.pyImportError: cannot import name 'run_subprocess' from 'numpy.testing._private.utils' (C:\Users\Anton\AppData\L
НАШЕ (на разбор)$IMPORTS\goblin-corpus\train\venv\Lib\site-packages\numpy\tests\test_reloading.pyImportError: cannot import name 'run_subprocess' from 'numpy.testing._private.utils' (C:\Users\Anton\AppData\L
НАШЕ (на разбор)$IMPORTS\goblin-corpus\train\venv\Lib\site-packages\numpy\typing\tests\test_runtime.pyAttributeError: type object 'numpy.ndarray' has no attribute '__value__'. Did you mean: '__le__'?
ОКРУЖЕНИЕ (нет пакета)$IMPORTS\goblin-corpus\train\venv\Lib\site-packages\pandas\tests\api\test_api.pyModuleNotFoundError: No module named 'pandas'
ОКРУЖЕНИЕ (нет пакета)$IMPORTS\goblin-corpus\train\venv\Lib\site-packages\pandas\tests\api\test_types.pyModuleNotFoundError: No module named 'pandas'
ОКРУЖЕНИЕ (нет пакета)$IMPORTS\goblin-corpus\train\venv\Lib\site-packages\pandas\tests\apply\test_frame_apply.pyModuleNotFoundError: No module named 'pandas'
ОКРУЖЕНИЕ (нет пакета)$IMPORTS\goblin-corpus\train\venv\Lib\site-packages\pandas\tests\apply\test_frame_apply_relabeling.pyModuleNotFoundError: No module named 'pandas'
ОКРУЖЕНИЕ (нет пакета)$IMPORTS\goblin-corpus\train\venv\Lib\site-packages\pandas\tests\apply\test_frame_transform.pyModuleNotFoundError: No module named 'pandas'
ОКРУЖЕНИЕ (нет пакета)$IMPORTS\goblin-corpus\train\venv\Lib\site-packages\pandas\tests\apply\test_invalid_arg.pyModuleNotFoundError: No module named 'pandas'
ОКРУЖЕНИЕ (нет пакета)$IMPORTS\goblin-corpus\train\venv\Lib\site-packages\pandas\tests\apply\test_numba.pyModuleNotFoundError: No module named 'pandas'
ОКРУЖЕНИЕ (нет пакета)$IMPORTS\goblin-corpus\train\venv\Lib\site-packages\pandas\tests\apply\test_series_apply.pyModuleNotFoundError: No module named 'pandas'
ОКРУЖЕНИЕ (нет пакета)$IMPORTS\goblin-corpus\train\venv\Lib\site-packages\pandas\tests\apply\test_series_apply_relabeling.pyModuleNotFoundError: No module named 'pandas'
ОКРУЖЕНИЕ (нет пакета)$IMPORTS\goblin-corpus\train\venv\Lib\site-packages\pandas\tests\apply\test_series_transform.pyModuleNotFoundError: No module named 'pandas'
ОКРУЖЕНИЕ (нет пакета)$IMPORTS\goblin-corpus\train\venv\Lib\site-packages\pandas\tests\apply\test_str.pyModuleNotFoundError: No module named 'pandas'
ОКРУЖЕНИЕ (нет пакета)$IMPORTS\goblin-corpus\train\venv\Lib\site-packages\pandas\tests\arithmetic\test_array_ops.pyModuleNotFoundError: No module named 'pandas'
ОКРУЖЕНИЕ (нет пакета)$IMPORTS\goblin-corpus\train\venv\Lib\site-packages\pandas\tests\arithmetic\test_bool.pyModuleNotFoundError: No module named 'pandas'
ОКРУЖЕНИЕ (нет пакета)$IMPORTS\goblin-corpus\train\venv\Lib\site-packages\pandas\tests\arithmetic\test_categorical.pyModuleNotFoundError: No module named 'pandas'
ОКРУЖЕНИЕ (нет пакета)$IMPORTS\goblin-corpus\train\venv\Lib\site-packages\pandas\tests\arithmetic\test_datetime64.pyModuleNotFoundError: No module named 'pandas'
ОКРУЖЕНИЕ (нет пакета)$IMPORTS\goblin-corpus\train\venv\Lib\site-packages\pandas\tests\arithmetic\test_interval.pyModuleNotFoundError: No module named 'pandas'
ОКРУЖЕНИЕ (нет пакета)$IMPORTS\goblin-corpus\train\venv\Lib\site-packages\pandas\tests\arithmetic\test_numeric.pyModuleNotFoundError: No module named 'pandas'
ОКРУЖЕНИЕ (нет пакета)$IMPORTS\goblin-corpus\train\venv\Lib\site-packages\pandas\tests\arithmetic\test_object.pyModuleNotFoundError: No module named 'pandas'
ОКРУЖЕНИЕ (нет пакета)$IMPORTS\goblin-corpus\train\venv\Lib\site-packages\pandas\tests\arithmetic\test_period.pyModuleNotFoundError: No module named 'pandas'
ОКРУЖЕНИЕ (нет пакета)$IMPORTS\goblin-corpus\train\venv\Lib\site-packages\pandas\tests\arithmetic\test_string.pyModuleNotFoundError: No module named 'pandas'
ОКРУЖЕНИЕ (нет пакета)$IMPORTS\goblin-corpus\train\venv\Lib\site-packages\pandas\tests\arithmetic\test_timedelta64.pyModuleNotFoundError: No module named 'pandas'
ОКРУЖЕНИЕ (нет пакета)$IMPORTS\goblin-corpus\train\venv\Lib\site-packages\pandas\tests\arrays\boolean\test_arithmetic.pyModuleNotFoundError: No module named 'pandas'
ОКРУЖЕНИЕ (нет пакета)$IMPORTS\goblin-corpus\train\venv\Lib\site-packages\pandas\tests\arrays\boolean\test_astype.pyModuleNotFoundError: No module named 'pandas'
ОКРУЖЕНИЕ (нет пакета)$IMPORTS\goblin-corpus\train\venv\Lib\site-packages\pandas\tests\arrays\boolean\test_comparison.pyModuleNotFoundError: No module named 'pandas'
ОКРУЖЕНИЕ (нет пакета)$IMPORTS\goblin-corpus\train\venv\Lib\site-packages\pandas\tests\arrays\boolean\test_construction.pyModuleNotFoundError: No module named 'pandas'
ОКРУЖЕНИЕ (нет пакета)$IMPORTS\goblin-corpus\train\venv\Lib\site-packages\pandas\tests\arrays\boolean\test_function.pyModuleNotFoundError: No module named 'pandas'
ОКРУЖЕНИЕ (нет пакета)$IMPORTS\goblin-corpus\train\venv\Lib\site-packages\pandas\tests\arrays\boolean\test_indexing.pyModuleNotFoundError: No module named 'pandas'
ОКРУЖЕНИЕ (нет пакета)$IMPORTS\goblin-corpus\train\venv\Lib\site-packages\pandas\tests\arrays\boolean\test_logical.pyModuleNotFoundError: No module named 'pandas'
ОКРУЖЕНИЕ (нет пакета)$IMPORTS\goblin-corpus\train\venv\Lib\site-packages\pandas\tests\arrays\boolean\test_ops.pyModuleNotFoundError: No module named 'pandas'
ОКРУЖЕНИЕ (нет пакета)$IMPORTS\goblin-corpus\train\venv\Lib\site-packages\pandas\tests\arrays\boolean\test_reduction.pyModuleNotFoundError: No module named 'pandas'
ОКРУЖЕНИЕ (нет пакета)$IMPORTS\goblin-corpus\train\venv\Lib\site-packages\pandas\tests\arrays\boolean\test_repr.pyModuleNotFoundError: No module named 'pandas'
ОКРУЖЕНИЕ (нет пакета)$IMPORTS\goblin-corpus\train\venv\Lib\site-packages\pandas\tests\arrays\categorical\test_algos.pyModuleNotFoundError: No module named 'pandas'
ОКРУЖЕНИЕ (нет пакета)$IMPORTS\goblin-corpus\train\venv\Lib\site-packages\pandas\tests\arrays\categorical\test_analytics.pyModuleNotFoundError: No module named 'pandas'
ОКРУЖЕНИЕ (нет пакета)$IMPORTS\goblin-corpus\train\venv\Lib\site-packages\pandas\tests\arrays\categorical\test_api.pyModuleNotFoundError: No module named 'pandas'
ОКРУЖЕНИЕ (нет пакета)$IMPORTS\goblin-corpus\train\venv\Lib\site-packages\pandas\tests\arrays\categorical\test_astype.pyModuleNotFoundError: No module named 'pandas'
ОКРУЖЕНИЕ (нет пакета)$IMPORTS\goblin-corpus\train\venv\Lib\site-packages\pandas\tests\arrays\categorical\test_constructors.pyModuleNotFoundError: No module named 'pandas'
ОКРУЖЕНИЕ (нет пакета)$IMPORTS\goblin-corpus\train\venv\Lib\site-packages\pandas\tests\arrays\categorical\test_dtypes.pyModuleNotFoundError: No module named 'pandas'
ОКРУЖЕНИЕ (нет пакета)$IMPORTS\goblin-corpus\train\venv\Lib\site-packages\pandas\tests\arrays\categorical\test_indexing.pyModuleNotFoundError: No module named 'pandas'
ОКРУЖЕНИЕ (нет пакета)$IMPORTS\goblin-corpus\train\venv\Lib\site-packages\pandas\tests\arrays\categorical\test_map.pyModuleNotFoundError: No module named 'pandas'
ОКРУЖЕНИЕ (нет пакета)$IMPORTS\goblin-corpus\train\venv\Lib\site-packages\pandas\tests\arrays\categorical\test_missing.pyModuleNotFoundError: No module named 'pandas'
ОКРУЖЕНИЕ (нет пакета)$IMPORTS\goblin-corpus\train\venv\Lib\site-packages\pandas\tests\arrays\categorical\test_operators.pyModuleNotFoundError: No module named 'pandas'
ОКРУЖЕНИЕ (нет пакета)$IMPORTS\goblin-corpus\train\venv\Lib\site-packages\pandas\tests\arrays\categorical\test_replace.pyModuleNotFoundError: No module named 'pandas'
ОКРУЖЕНИЕ (нет пакета)$IMPORTS\goblin-corpus\train\venv\Lib\site-packages\pandas\tests\arrays\categorical\test_repr.pyModuleNotFoundError: No module named 'pandas'
ОКРУЖЕНИЕ (нет пакета)$IMPORTS\goblin-corpus\train\venv\Lib\site-packages\pandas\tests\arrays\categorical\test_sorting.pyModuleNotFoundError: No module named 'pandas'
ОКРУЖЕНИЕ (нет пакета)$IMPORTS\goblin-corpus\train\venv\Lib\site-packages\pandas\tests\arrays\categorical\test_subclass.pyModuleNotFoundError: No module named 'pandas'
ОКРУЖЕНИЕ (нет пакета)$IMPORTS\goblin-corpus\train\venv\Lib\site-packages\pandas\tests\arrays\categorical\test_take.pyModuleNotFoundError: No module named 'pandas'
ОКРУЖЕНИЕ (нет пакета)$IMPORTS\goblin-corpus\train\venv\Lib\site-packages\pandas\tests\arrays\categorical\test_warnings.pyModuleNotFoundError: No module named 'pandas'
ОКРУЖЕНИЕ (нет пакета)$IMPORTS\goblin-corpus\train\venv\Lib\site-packages\pandas\tests\arrays\datetimes\test_constructors.pyModuleNotFoundError: No module named 'pandas'
ОКРУЖЕНИЕ (нет пакета)$IMPORTS\goblin-corpus\train\venv\Lib\site-packages\pandas\tests\arrays\datetimes\test_cumulative.pyModuleNotFoundError: No module named 'pandas'
ОКРУЖЕНИЕ (нет пакета)$IMPORTS\goblin-corpus\train\venv\Lib\site-packages\pandas\tests\arrays\datetimes\test_reductions.pyModuleNotFoundError: No module named 'pandas'
ОКРУЖЕНИЕ (нет пакета)$IMPORTS\goblin-corpus\train\venv\Lib\site-packages\pandas\tests\arrays\floating\test_arithmetic.pyModuleNotFoundError: No module named 'pandas'
ОКРУЖЕНИЕ (нет пакета)$IMPORTS\goblin-corpus\train\venv\Lib\site-packages\pandas\tests\arrays\floating\test_astype.pyModuleNotFoundError: No module named 'pandas'
ОКРУЖЕНИЕ (нет пакета)$IMPORTS\goblin-corpus\train\venv\Lib\site-packages\pandas\tests\arrays\floating\test_comparison.pyModuleNotFoundError: No module named 'pandas'
ОКРУЖЕНИЕ (нет пакета)$IMPORTS\goblin-corpus\train\venv\Lib\site-packages\pandas\tests\arrays\floating\test_concat.pyModuleNotFoundError: No module named 'pandas'
ОКРУЖЕНИЕ (нет пакета)$IMPORTS\goblin-corpus\train\venv\Lib\site-packages\pandas\tests\arrays\floating\test_construction.pyModuleNotFoundError: No module named 'pandas'
ОКРУЖЕНИЕ (нет пакета)$IMPORTS\goblin-corpus\train\venv\Lib\site-packages\pandas\tests\arrays\floating\test_contains.pyModuleNotFoundError: No module named 'pandas'
ОКРУЖЕНИЕ (нет пакета)$IMPORTS\goblin-corpus\train\venv\Lib\site-packages\pandas\tests\arrays\floating\test_function.pyModuleNotFoundError: No module named 'pandas'
ОКРУЖЕНИЕ (нет пакета)$IMPORTS\goblin-corpus\train\venv\Lib\site-packages\pandas\tests\arrays\floating\test_repr.pyModuleNotFoundError: No module named 'pandas'
ОКРУЖЕНИЕ (нет пакета)$IMPORTS\goblin-corpus\train\venv\Lib\site-packages\pandas\tests\arrays\floating\test_to_numpy.pyModuleNotFoundError: No module named 'pandas'
ОКРУЖЕНИЕ (нет пакета)$IMPORTS\goblin-corpus\train\venv\Lib\site-packages\pandas\tests\arrays\integer\test_arithmetic.pyModuleNotFoundError: No module named 'pandas'
ОКРУЖЕНИЕ (нет пакета)$IMPORTS\goblin-corpus\train\venv\Lib\site-packages\pandas\tests\arrays\integer\test_comparison.pyModuleNotFoundError: No module named 'pandas'
ОКРУЖЕНИЕ (нет пакета)$IMPORTS\goblin-corpus\train\venv\Lib\site-packages\pandas\tests\arrays\integer\test_concat.pyModuleNotFoundError: No module named 'pandas'
ОКРУЖЕНИЕ (нет пакета)$IMPORTS\goblin-corpus\train\venv\Lib\site-packages\pandas\tests\arrays\integer\test_construction.pyModuleNotFoundError: No module named 'pandas'
ОКРУЖЕНИЕ (нет пакета)$IMPORTS\goblin-corpus\train\venv\Lib\site-packages\pandas\tests\arrays\integer\test_dtypes.pyModuleNotFoundError: No module named 'pandas'
ОКРУЖЕНИЕ (нет пакета)$IMPORTS\goblin-corpus\train\venv\Lib\site-packages\pandas\tests\arrays\integer\test_function.pyModuleNotFoundError: No module named 'pandas'
ОКРУЖЕНИЕ (нет пакета)$IMPORTS\goblin-corpus\train\venv\Lib\site-packages\pandas\tests\arrays\integer\test_indexing.pyModuleNotFoundError: No module named 'pandas'
ОКРУЖЕНИЕ (нет пакета)$IMPORTS\goblin-corpus\train\venv\Lib\site-packages\pandas\tests\arrays\integer\test_reduction.pyModuleNotFoundError: No module named 'pandas'
ОКРУЖЕНИЕ (нет пакета)$IMPORTS\goblin-corpus\train\venv\Lib\site-packages\pandas\tests\arrays\integer\test_repr.pyModuleNotFoundError: No module named 'pandas'
ОКРУЖЕНИЕ (нет пакета)$IMPORTS\goblin-corpus\train\venv\Lib\site-packages\pandas\tests\arrays\interval\test_astype.pyModuleNotFoundError: No module named 'pandas'
ОКРУЖЕНИЕ (нет пакета)$IMPORTS\goblin-corpus\train\venv\Lib\site-packages\pandas\tests\arrays\interval\test_formats.pyModuleNotFoundError: No module named 'pandas'
ОКРУЖЕНИЕ (нет пакета)$IMPORTS\goblin-corpus\train\venv\Lib\site-packages\pandas\tests\arrays\interval\test_interval.pyModuleNotFoundError: No module named 'pandas'
ОКРУЖЕНИЕ (нет пакета)$IMPORTS\goblin-corpus\train\venv\Lib\site-packages\pandas\tests\arrays\interval\test_interval_pyarrow.pyModuleNotFoundError: No module named 'pandas'
ОКРУЖЕНИЕ (нет пакета)$IMPORTS\goblin-corpus\train\venv\Lib\site-packages\pandas\tests\arrays\interval\test_overlaps.pyModuleNotFoundError: No module named 'pandas'
ОКРУЖЕНИЕ (нет пакета)$IMPORTS\goblin-corpus\train\venv\Lib\site-packages\pandas\tests\arrays\masked\test_arithmetic.pyModuleNotFoundError: No module named 'pandas'
ОКРУЖЕНИЕ (нет пакета)$IMPORTS\goblin-corpus\train\venv\Lib\site-packages\pandas\tests\arrays\masked\test_arrow_compat.pyModuleNotFoundError: No module named 'pandas'
ОКРУЖЕНИЕ (нет пакета)$IMPORTS\goblin-corpus\train\venv\Lib\site-packages\pandas\tests\arrays\masked\test_function.pyModuleNotFoundError: No module named 'pandas'
ОКРУЖЕНИЕ (нет пакета)$IMPORTS\goblin-corpus\train\venv\Lib\site-packages\pandas\tests\arrays\masked\test_indexing.pyModuleNotFoundError: No module named 'pandas'
ОКРУЖЕНИЕ (нет пакета)$IMPORTS\goblin-corpus\train\venv\Lib\site-packages\pandas\tests\arrays\numpy_\test_indexing.pyModuleNotFoundError: No module named 'pandas'
ОКРУЖЕНИЕ (нет пакета)$IMPORTS\goblin-corpus\train\venv\Lib\site-packages\pandas\tests\arrays\numpy_\test_numpy.pyModuleNotFoundError: No module named 'pandas'
ОКРУЖЕНИЕ (нет пакета)$IMPORTS\goblin-corpus\train\venv\Lib\site-packages\pandas\tests\arrays\period\test_arrow_compat.pyModuleNotFoundError: No module named 'pandas'
ОКРУЖЕНИЕ (нет пакета)$IMPORTS\goblin-corpus\train\venv\Lib\site-packages\pandas\tests\arrays\period\test_astype.pyModuleNotFoundError: No module named 'pandas'
ОКРУЖЕНИЕ (нет пакета)$IMPORTS\goblin-corpus\train\venv\Lib\site-packages\pandas\tests\arrays\period\test_constructors.pyModuleNotFoundError: No module named 'pandas'
ОКРУЖЕНИЕ (нет пакета)$IMPORTS\goblin-corpus\train\venv\Lib\site-packages\pandas\tests\arrays\period\test_reductions.pyModuleNotFoundError: No module named 'pandas'
ОКРУЖЕНИЕ (нет пакета)$IMPORTS\goblin-corpus\train\venv\Lib\site-packages\pandas\tests\arrays\sparse\test_accessor.pyModuleNotFoundError: No module named 'pandas'
ОКРУЖЕНИЕ (нет пакета)$IMPORTS\goblin-corpus\train\venv\Lib\site-packages\pandas\tests\arrays\sparse\test_arithmetics.pyModuleNotFoundError: No module named 'pandas'
ОКРУЖЕНИЕ (нет пакета)$IMPORTS\goblin-corpus\train\venv\Lib\site-packages\pandas\tests\arrays\sparse\test_array.pyModuleNotFoundError: No module named 'pandas'
ОКРУЖЕНИЕ (нет пакета)$IMPORTS\goblin-corpus\train\venv\Lib\site-packages\pandas\tests\arrays\sparse\test_astype.pyModuleNotFoundError: No module named 'pandas'
ОКРУЖЕНИЕ (нет пакета)$IMPORTS\goblin-corpus\train\venv\Lib\site-packages\pandas\tests\arrays\sparse\test_combine_concat.pyModuleNotFoundError: No module named 'pandas'
ОКРУЖЕНИЕ (нет пакета)$IMPORTS\goblin-corpus\train\venv\Lib\site-packages\pandas\tests\arrays\sparse\test_constructors.pyModuleNotFoundError: No module named 'pandas'
ОКРУЖЕНИЕ (нет пакета)$IMPORTS\goblin-corpus\train\venv\Lib\site-packages\pandas\tests\arrays\sparse\test_dtype.pyModuleNotFoundError: No module named 'pandas'
ОКРУЖЕНИЕ (нет пакета)$IMPORTS\goblin-corpus\train\venv\Lib\site-packages\pandas\tests\arrays\sparse\test_indexing.pyModuleNotFoundError: No module named 'pandas'
ОКРУЖЕНИЕ (нет пакета)$IMPORTS\goblin-corpus\train\venv\Lib\site-packages\pandas\tests\arrays\sparse\test_libsparse.pyModuleNotFoundError: No module named 'pandas'
ОКРУЖЕНИЕ (нет пакета)$IMPORTS\goblin-corpus\train\venv\Lib\site-packages\pandas\tests\arrays\sparse\test_reductions.pyModuleNotFoundError: No module named 'pandas'
ОКРУЖЕНИЕ (нет пакета)$IMPORTS\goblin-corpus\train\venv\Lib\site-packages\pandas\tests\arrays\sparse\test_unary.pyModuleNotFoundError: No module named 'pandas'
ОКРУЖЕНИЕ (нет пакета)$IMPORTS\goblin-corpus\train\venv\Lib\site-packages\pandas\tests\arrays\string_\test_concat.pyModuleNotFoundError: No module named 'pandas'
ОКРУЖЕНИЕ (нет пакета)$IMPORTS\goblin-corpus\train\venv\Lib\site-packages\pandas\tests\arrays\string_\test_string.pyModuleNotFoundError: No module named 'pandas'
ОКРУЖЕНИЕ (нет пакета)$IMPORTS\goblin-corpus\train\venv\Lib\site-packages\pandas\tests\arrays\string_\test_string_arrow.pyModuleNotFoundError: No module named 'pandas'
ОКРУЖЕНИЕ (нет пакета)$IMPORTS\goblin-corpus\train\venv\Lib\site-packages\pandas\tests\arrays\test_array.pyModuleNotFoundError: No module named 'pandas'
ОКРУЖЕНИЕ (нет пакета)$IMPORTS\goblin-corpus\train\venv\Lib\site-packages\pandas\tests\arrays\test_datetimelike.pyModuleNotFoundError: No module named 'pandas'
ОКРУЖЕНИЕ (нет пакета)$IMPORTS\goblin-corpus\train\venv\Lib\site-packages\pandas\tests\arrays\test_datetimes.pyModuleNotFoundError: No module named 'pandas'
ОКРУЖЕНИЕ (нет пакета)$IMPORTS\goblin-corpus\train\venv\Lib\site-packages\pandas\tests\arrays\test_ndarray_backed.pyModuleNotFoundError: No module named 'pandas'
ОКРУЖЕНИЕ (нет пакета)$IMPORTS\goblin-corpus\train\venv\Lib\site-packages\pandas\tests\arrays\test_period.pyModuleNotFoundError: No module named 'pandas'
ОКРУЖЕНИЕ (нет пакета)$IMPORTS\goblin-corpus\train\venv\Lib\site-packages\pandas\tests\arrays\test_timedeltas.pyModuleNotFoundError: No module named 'pandas'
ОКРУЖЕНИЕ (нет пакета)$IMPORTS\goblin-corpus\train\venv\Lib\site-packages\pandas\tests\arrays\timedeltas\test_constructors.pyModuleNotFoundError: No module named 'pandas'
ОКРУЖЕНИЕ (нет пакета)$IMPORTS\goblin-corpus\train\venv\Lib\site-packages\pandas\tests\arrays\timedeltas\test_cumulative.pyModuleNotFoundError: No module named 'pandas'
ОКРУЖЕНИЕ (нет пакета)$IMPORTS\goblin-corpus\train\venv\Lib\site-packages\pandas\tests\arrays\timedeltas\test_reductions.pyModuleNotFoundError: No module named 'pandas'
ОКРУЖЕНИЕ (нет пакета)$IMPORTS\goblin-corpus\train\venv\Lib\site-packages\pandas\tests\base\test_constructors.pyModuleNotFoundError: No module named 'pandas'
ОКРУЖЕНИЕ (нет пакета)$IMPORTS\goblin-corpus\train\venv\Lib\site-packages\pandas\tests\base\test_conversion.pyModuleNotFoundError: No module named 'pandas'
ОКРУЖЕНИЕ (нет пакета)$IMPORTS\goblin-corpus\train\venv\Lib\site-packages\pandas\tests\base\test_fillna.pyModuleNotFoundError: No module named 'pandas'
ОКРУЖЕНИЕ (нет пакета)$IMPORTS\goblin-corpus\train\venv\Lib\site-packages\pandas\tests\base\test_misc.pyModuleNotFoundError: No module named 'pandas'
ОКРУЖЕНИЕ (нет пакета)$IMPORTS\goblin-corpus\train\venv\Lib\site-packages\pandas\tests\base\test_transpose.pyModuleNotFoundError: No module named 'pandas'
ОКРУЖЕНИЕ (нет пакета)$IMPORTS\goblin-corpus\train\venv\Lib\site-packages\pandas\tests\base\test_unique.pyModuleNotFoundError: No module named 'pandas'
ОКРУЖЕНИЕ (нет пакета)$IMPORTS\goblin-corpus\train\venv\Lib\site-packages\pandas\tests\base\test_value_counts.pyModuleNotFoundError: No module named 'pandas'
ОКРУЖЕНИЕ (нет пакета)$IMPORTS\goblin-corpus\train\venv\Lib\site-packages\pandas\tests\computation\test_compat.pyModuleNotFoundError: No module named 'pandas'
ОКРУЖЕНИЕ (нет пакета)$IMPORTS\goblin-corpus\train\venv\Lib\site-packages\pandas\tests\computation\test_eval.pyModuleNotFoundError: No module named 'pandas'
ОКРУЖЕНИЕ (нет пакета)$IMPORTS\goblin-corpus\train\venv\Lib\site-packages\pandas\tests\config\test_config.pyModuleNotFoundError: No module named 'pandas'
ОКРУЖЕНИЕ (нет пакета)$IMPORTS\goblin-corpus\train\venv\Lib\site-packages\pandas\tests\config\test_localization.pyModuleNotFoundError: No module named 'pandas'
ОКРУЖЕНИЕ (нет пакета)$IMPORTS\goblin-corpus\train\venv\Lib\site-packages\pandas\tests\construction\test_extract_array.pyModuleNotFoundError: No module named 'pandas'
ОКРУЖЕНИЕ (нет пакета)$IMPORTS\goblin-corpus\train\venv\Lib\site-packages\pandas\tests\copy_view\index\test_datetimeindex.pyModuleNotFoundError: No module named 'pandas'
ОКРУЖЕНИЕ (нет пакета)$IMPORTS\goblin-corpus\train\venv\Lib\site-packages\pandas\tests\copy_view\index\test_index.pyModuleNotFoundError: No module named 'pandas'
ОКРУЖЕНИЕ (нет пакета)$IMPORTS\goblin-corpus\train\venv\Lib\site-packages\pandas\tests\copy_view\index\test_intervalindex.pyModuleNotFoundError: No module named 'pandas'
ОКРУЖЕНИЕ (нет пакета)$IMPORTS\goblin-corpus\train\venv\Lib\site-packages\pandas\tests\copy_view\index\test_periodindex.pyModuleNotFoundError: No module named 'pandas'
ОКРУЖЕНИЕ (нет пакета)$IMPORTS\goblin-corpus\train\venv\Lib\site-packages\pandas\tests\copy_view\index\test_timedeltaindex.pyModuleNotFoundError: No module named 'pandas'
ОКРУЖЕНИЕ (нет пакета)$IMPORTS\goblin-corpus\train\venv\Lib\site-packages\pandas\tests\copy_view\test_array.pyModuleNotFoundError: No module named 'pandas'
ОКРУЖЕНИЕ (нет пакета)$IMPORTS\goblin-corpus\train\venv\Lib\site-packages\pandas\tests\copy_view\test_astype.pyModuleNotFoundError: No module named 'pandas'
ОКРУЖЕНИЕ (нет пакета)$IMPORTS\goblin-corpus\train\venv\Lib\site-packages\pandas\tests\copy_view\test_chained_assignment_deprecation.pyModuleNotFoundError: No module named 'pandas'
ОКРУЖЕНИЕ (нет пакета)$IMPORTS\goblin-corpus\train\venv\Lib\site-packages\pandas\tests\copy_view\test_clip.pyModuleNotFoundError: No module named 'pandas'
ОКРУЖЕНИЕ (нет пакета)$IMPORTS\goblin-corpus\train\venv\Lib\site-packages\pandas\tests\copy_view\test_constructors.pyModuleNotFoundError: No module named 'pandas'
ОКРУЖЕНИЕ (нет пакета)$IMPORTS\goblin-corpus\train\venv\Lib\site-packages\pandas\tests\copy_view\test_copy_deprecation.pyModuleNotFoundError: No module named 'pandas'
ОКРУЖЕНИЕ (нет пакета)$IMPORTS\goblin-corpus\train\venv\Lib\site-packages\pandas\tests\copy_view\test_core_functionalities.pyModuleNotFoundError: No module named 'pandas'
ОКРУЖЕНИЕ (нет пакета)$IMPORTS\goblin-corpus\train\venv\Lib\site-packages\pandas\tests\copy_view\test_functions.pyModuleNotFoundError: No module named 'pandas'
ОКРУЖЕНИЕ (нет пакета)$IMPORTS\goblin-corpus\train\venv\Lib\site-packages\pandas\tests\copy_view\test_indexing.pyModuleNotFoundError: No module named 'pandas'
ОКРУЖЕНИЕ (нет пакета)$IMPORTS\goblin-corpus\train\venv\Lib\site-packages\pandas\tests\copy_view\test_internals.pyModuleNotFoundError: No module named 'pandas'
ОКРУЖЕНИЕ (нет пакета)$IMPORTS\goblin-corpus\train\venv\Lib\site-packages\pandas\tests\copy_view\test_interp_fillna.pyModuleNotFoundError: No module named 'pandas'
ОКРУЖЕНИЕ (нет пакета)$IMPORTS\goblin-corpus\train\venv\Lib\site-packages\pandas\tests\copy_view\test_methods.pyModuleNotFoundError: No module named 'pandas'
ОКРУЖЕНИЕ (нет пакета)$IMPORTS\goblin-corpus\train\venv\Lib\site-packages\pandas\tests\copy_view\test_replace.pyModuleNotFoundError: No module named 'pandas'
ОКРУЖЕНИЕ (нет пакета)$IMPORTS\goblin-corpus\train\venv\Lib\site-packages\pandas\tests\copy_view\test_setitem.pyModuleNotFoundError: No module named 'pandas'
ОКРУЖЕНИЕ (нет пакета)$IMPORTS\goblin-corpus\train\venv\Lib\site-packages\pandas\tests\copy_view\test_util.pyModuleNotFoundError: No module named 'pandas'
ОКРУЖЕНИЕ (нет пакета)$IMPORTS\goblin-corpus\train\venv\Lib\site-packages\pandas\tests\dtypes\cast\test_box_unbox.pyModuleNotFoundError: No module named 'pandas'
ОКРУЖЕНИЕ (нет пакета)$IMPORTS\goblin-corpus\train\venv\Lib\site-packages\pandas\tests\dtypes\cast\test_can_hold_element.pyModuleNotFoundError: No module named 'pandas'
ОКРУЖЕНИЕ (нет пакета)$IMPORTS\goblin-corpus\train\venv\Lib\site-packages\pandas\tests\dtypes\cast\test_construct_from_scalar.pyModuleNotFoundError: No module named 'pandas'
ОКРУЖЕНИЕ (нет пакета)$IMPORTS\goblin-corpus\train\venv\Lib\site-packages\pandas\tests\dtypes\cast\test_construct_ndarray.pyModuleNotFoundError: No module named 'pandas'
ОКРУЖЕНИЕ (нет пакета)$IMPORTS\goblin-corpus\train\venv\Lib\site-packages\pandas\tests\dtypes\cast\test_construct_object_arr.pyModuleNotFoundError: No module named 'pandas'
ОКРУЖЕНИЕ (нет пакета)$IMPORTS\goblin-corpus\train\venv\Lib\site-packages\pandas\tests\dtypes\cast\test_dict_compat.pyModuleNotFoundError: No module named 'pandas'
ОКРУЖЕНИЕ (нет пакета)$IMPORTS\goblin-corpus\train\venv\Lib\site-packages\pandas\tests\dtypes\cast\test_downcast.pyModuleNotFoundError: No module named 'pandas'
ОКРУЖЕНИЕ (нет пакета)$IMPORTS\goblin-corpus\train\venv\Lib\site-packages\pandas\tests\dtypes\cast\test_find_common_type.pyModuleNotFoundError: No module named 'pandas'
ОКРУЖЕНИЕ (нет пакета)$IMPORTS\goblin-corpus\train\venv\Lib\site-packages\pandas\tests\dtypes\cast\test_infer_datetimelike.pyModuleNotFoundError: No module named 'pandas'
ОКРУЖЕНИЕ (нет пакета)$IMPORTS\goblin-corpus\train\venv\Lib\site-packages\pandas\tests\dtypes\cast\test_infer_dtype.pyModuleNotFoundError: No module named 'pandas'
ОКРУЖЕНИЕ (нет пакета)$IMPORTS\goblin-corpus\train\venv\Lib\site-packages\pandas\tests\dtypes\cast\test_promote.pyModuleNotFoundError: No module named 'pandas'
ОКРУЖЕНИЕ (нет пакета)$IMPORTS\goblin-corpus\train\venv\Lib\site-packages\pandas\tests\dtypes\test_common.pyModuleNotFoundError: No module named 'pandas'
ОКРУЖЕНИЕ (нет пакета)$IMPORTS\goblin-corpus\train\venv\Lib\site-packages\pandas\tests\dtypes\test_concat.pyModuleNotFoundError: No module named 'pandas'
ОКРУЖЕНИЕ (нет пакета)$IMPORTS\goblin-corpus\train\venv\Lib\site-packages\pandas\tests\dtypes\test_dtypes.pyModuleNotFoundError: No module named 'pandas'
ОКРУЖЕНИЕ (нет пакета)$IMPORTS\goblin-corpus\train\venv\Lib\site-packages\pandas\tests\dtypes\test_generic.pyModuleNotFoundError: No module named 'pandas'
ОКРУЖЕНИЕ (нет пакета)$IMPORTS\goblin-corpus\train\venv\Lib\site-packages\pandas\tests\dtypes\test_inference.pyModuleNotFoundError: No module named 'pandas'
ОКРУЖЕНИЕ (нет пакета)$IMPORTS\goblin-corpus\train\venv\Lib\site-packages\pandas\tests\dtypes\test_missing.pyModuleNotFoundError: No module named 'pandas'
ОКРУЖЕНИЕ (нет пакета)$IMPORTS\goblin-corpus\train\venv\Lib\site-packages\pandas\tests\extension\array_with_attr\test_array_with_attr.pyModuleNotFoundError: No module named 'pandas'
ОКРУЖЕНИЕ (нет пакета)$IMPORTS\goblin-corpus\train\venv\Lib\site-packages\pandas\tests\extension\decimal\test_decimal.pyModuleNotFoundError: No module named 'pandas'
ОКРУЖЕНИЕ (нет пакета)$IMPORTS\goblin-corpus\train\venv\Lib\site-packages\pandas\tests\extension\json\test_json.pyModuleNotFoundError: No module named 'pandas'
ОКРУЖЕНИЕ (нет пакета)$IMPORTS\goblin-corpus\train\venv\Lib\site-packages\pandas\tests\extension\list\test_list.pyModuleNotFoundError: No module named 'pandas'
ОКРУЖЕНИЕ (нет пакета)$IMPORTS\goblin-corpus\train\venv\Lib\site-packages\pandas\tests\extension\test_arrow.pyModuleNotFoundError: No module named 'pandas'
ОКРУЖЕНИЕ (нет пакета)$IMPORTS\goblin-corpus\train\venv\Lib\site-packages\pandas\tests\extension\test_categorical.pyModuleNotFoundError: No module named 'pandas'
ОКРУЖЕНИЕ (нет пакета)$IMPORTS\goblin-corpus\train\venv\Lib\site-packages\pandas\tests\extension\test_common.pyModuleNotFoundError: No module named 'pandas'
ОКРУЖЕНИЕ (нет пакета)$IMPORTS\goblin-corpus\train\venv\Lib\site-packages\pandas\tests\extension\test_datetime.pyModuleNotFoundError: No module named 'pandas'
ОКРУЖЕНИЕ (нет пакета)$IMPORTS\goblin-corpus\train\venv\Lib\site-packages\pandas\tests\extension\test_extension.pyModuleNotFoundError: No module named 'pandas'
ОКРУЖЕНИЕ (нет пакета)$IMPORTS\goblin-corpus\train\venv\Lib\site-packages\pandas\tests\extension\test_interval.pyModuleNotFoundError: No module named 'pandas'
ОКРУЖЕНИЕ (нет пакета)$IMPORTS\goblin-corpus\train\venv\Lib\site-packages\pandas\tests\extension\test_masked.pyModuleNotFoundError: No module named 'pandas'
ОКРУЖЕНИЕ (нет пакета)$IMPORTS\goblin-corpus\train\venv\Lib\site-packages\pandas\tests\extension\test_numpy.pyModuleNotFoundError: No module named 'pandas'
ОКРУЖЕНИЕ (нет пакета)$IMPORTS\goblin-corpus\train\venv\Lib\site-packages\pandas\tests\extension\test_period.pyModuleNotFoundError: No module named 'pandas'
ОКРУЖЕНИЕ (нет пакета)$IMPORTS\goblin-corpus\train\venv\Lib\site-packages\pandas\tests\extension\test_sparse.pyModuleNotFoundError: No module named 'pandas'
ОКРУЖЕНИЕ (нет пакета)$IMPORTS\goblin-corpus\train\venv\Lib\site-packages\pandas\tests\extension\test_string.pyModuleNotFoundError: No module named 'pandas'
ОКРУЖЕНИЕ (нет пакета)$IMPORTS\goblin-corpus\train\venv\Lib\site-packages\pandas\tests\extension\uuid\test_uuid.pyModuleNotFoundError: No module named 'pandas'
ОКРУЖЕНИЕ (нет пакета)$IMPORTS\goblin-corpus\train\venv\Lib\site-packages\pandas\tests\frame\constructors\test_from_dict.pyModuleNotFoundError: No module named 'pandas'
ОКРУЖЕНИЕ (нет пакета)$IMPORTS\goblin-corpus\train\venv\Lib\site-packages\pandas\tests\frame\constructors\test_from_records.pyModuleNotFoundError: No module named 'pandas'
ОКРУЖЕНИЕ (нет пакета)$IMPORTS\goblin-corpus\train\venv\Lib\site-packages\pandas\tests\frame\indexing\test_coercion.pyModuleNotFoundError: No module named 'pandas'
ОКРУЖЕНИЕ (нет пакета)$IMPORTS\goblin-corpus\train\venv\Lib\site-packages\pandas\tests\frame\indexing\test_delitem.pyModuleNotFoundError: No module named 'pandas'
ОКРУЖЕНИЕ (нет пакета)$IMPORTS\goblin-corpus\train\venv\Lib\site-packages\pandas\tests\frame\indexing\test_get.pyModuleNotFoundError: No module named 'pandas'
ОКРУЖЕНИЕ (нет пакета)$IMPORTS\goblin-corpus\train\venv\Lib\site-packages\pandas\tests\frame\indexing\test_get_value.pyModuleNotFoundError: No module named 'pandas'
ОКРУЖЕНИЕ (нет пакета)$IMPORTS\goblin-corpus\train\venv\Lib\site-packages\pandas\tests\frame\indexing\test_getitem.pyModuleNotFoundError: No module named 'pandas'
ОКРУЖЕНИЕ (нет пакета)$IMPORTS\goblin-corpus\train\venv\Lib\site-packages\pandas\tests\frame\indexing\test_indexing.pyModuleNotFoundError: No module named 'pandas'
ОКРУЖЕНИЕ (нет пакета)$IMPORTS\goblin-corpus\train\venv\Lib\site-packages\pandas\tests\frame\indexing\test_insert.pyModuleNotFoundError: No module named 'pandas'
ОКРУЖЕНИЕ (нет пакета)$IMPORTS\goblin-corpus\train\venv\Lib\site-packages\pandas\tests\frame\indexing\test_mask.pyModuleNotFoundError: No module named 'pandas'
ОКРУЖЕНИЕ (нет пакета)$IMPORTS\goblin-corpus\train\venv\Lib\site-packages\pandas\tests\frame\indexing\test_set_value.pyModuleNotFoundError: No module named 'pandas'
ОКРУЖЕНИЕ (нет пакета)$IMPORTS\goblin-corpus\train\venv\Lib\site-packages\pandas\tests\frame\indexing\test_setitem.pyModuleNotFoundError: No module named 'pandas'
ОКРУЖЕНИЕ (нет пакета)$IMPORTS\goblin-corpus\train\venv\Lib\site-packages\pandas\tests\frame\indexing\test_take.pyModuleNotFoundError: No module named 'pandas'
ОКРУЖЕНИЕ (нет пакета)$IMPORTS\goblin-corpus\train\venv\Lib\site-packages\pandas\tests\frame\indexing\test_where.pyModuleNotFoundError: No module named 'hypothesis'
ОКРУЖЕНИЕ (нет пакета)$IMPORTS\goblin-corpus\train\venv\Lib\site-packages\pandas\tests\frame\indexing\test_xs.pyModuleNotFoundError: No module named 'pandas'
ОКРУЖЕНИЕ (нет пакета)$IMPORTS\goblin-corpus\train\venv\Lib\site-packages\pandas\tests\frame\methods\test_add_prefix_suffix.pyModuleNotFoundError: No module named 'pandas'
ОКРУЖЕНИЕ (нет пакета)$IMPORTS\goblin-corpus\train\venv\Lib\site-packages\pandas\tests\frame\methods\test_align.pyModuleNotFoundError: No module named 'pandas'
ОКРУЖЕНИЕ (нет пакета)$IMPORTS\goblin-corpus\train\venv\Lib\site-packages\pandas\tests\frame\methods\test_asfreq.pyModuleNotFoundError: No module named 'pandas'
ОКРУЖЕНИЕ (нет пакета)$IMPORTS\goblin-corpus\train\venv\Lib\site-packages\pandas\tests\frame\methods\test_asof.pyModuleNotFoundError: No module named 'pandas'
ОКРУЖЕНИЕ (нет пакета)$IMPORTS\goblin-corpus\train\venv\Lib\site-packages\pandas\tests\frame\methods\test_assign.pyModuleNotFoundError: No module named 'pandas'
ОКРУЖЕНИЕ (нет пакета)$IMPORTS\goblin-corpus\train\venv\Lib\site-packages\pandas\tests\frame\methods\test_astype.pyModuleNotFoundError: No module named 'pandas'
ОКРУЖЕНИЕ (нет пакета)$IMPORTS\goblin-corpus\train\venv\Lib\site-packages\pandas\tests\frame\methods\test_at_time.pyModuleNotFoundError: No module named 'pandas'
ОКРУЖЕНИЕ (нет пакета)$IMPORTS\goblin-corpus\train\venv\Lib\site-packages\pandas\tests\frame\methods\test_between_time.pyModuleNotFoundError: No module named 'pandas'
ОКРУЖЕНИЕ (нет пакета)$IMPORTS\goblin-corpus\train\venv\Lib\site-packages\pandas\tests\frame\methods\test_clip.pyModuleNotFoundError: No module named 'pandas'
ОКРУЖЕНИЕ (нет пакета)$IMPORTS\goblin-corpus\train\venv\Lib\site-packages\pandas\tests\frame\methods\test_combine.pyModuleNotFoundError: No module named 'pandas'
ОКРУЖЕНИЕ (нет пакета)$IMPORTS\goblin-corpus\train\venv\Lib\site-packages\pandas\tests\frame\methods\test_combine_first.pyModuleNotFoundError: No module named 'pandas'
ОКРУЖЕНИЕ (нет пакета)$IMPORTS\goblin-corpus\train\venv\Lib\site-packages\pandas\tests\frame\methods\test_compare.pyModuleNotFoundError: No module named 'pandas'
ОКРУЖЕНИЕ (нет пакета)$IMPORTS\goblin-corpus\train\venv\Lib\site-packages\pandas\tests\frame\methods\test_convert_dtypes.pyModuleNotFoundError: No module named 'pandas'
ОКРУЖЕНИЕ (нет пакета)$IMPORTS\goblin-corpus\train\venv\Lib\site-packages\pandas\tests\frame\methods\test_copy.pyModuleNotFoundError: No module named 'pandas'
ОКРУЖЕНИЕ (нет пакета)$IMPORTS\goblin-corpus\train\venv\Lib\site-packages\pandas\tests\frame\methods\test_count.pyModuleNotFoundError: No module named 'pandas'
ОКРУЖЕНИЕ (нет пакета)$IMPORTS\goblin-corpus\train\venv\Lib\site-packages\pandas\tests\frame\methods\test_cov_corr.pyModuleNotFoundError: No module named 'pandas'
ОКРУЖЕНИЕ (нет пакета)$IMPORTS\goblin-corpus\train\venv\Lib\site-packages\pandas\tests\frame\methods\test_describe.pyModuleNotFoundError: No module named 'pandas'
ОКРУЖЕНИЕ (нет пакета)$IMPORTS\goblin-corpus\train\venv\Lib\site-packages\pandas\tests\frame\methods\test_diff.pyModuleNotFoundError: No module named 'pandas'
ОКРУЖЕНИЕ (нет пакета)$IMPORTS\goblin-corpus\train\venv\Lib\site-packages\pandas\tests\frame\methods\test_dot.pyModuleNotFoundError: No module named 'pandas'
ОКРУЖЕНИЕ (нет пакета)$IMPORTS\goblin-corpus\train\venv\Lib\site-packages\pandas\tests\frame\methods\test_drop.pyModuleNotFoundError: No module named 'pandas'
ОКРУЖЕНИЕ (нет пакета)$IMPORTS\goblin-corpus\train\venv\Lib\site-packages\pandas\tests\frame\methods\test_drop_duplicates.pyModuleNotFoundError: No module named 'pandas'
ОКРУЖЕНИЕ (нет пакета)$IMPORTS\goblin-corpus\train\venv\Lib\site-packages\pandas\tests\frame\methods\test_droplevel.pyModuleNotFoundError: No module named 'pandas'
ОКРУЖЕНИЕ (нет пакета)$IMPORTS\goblin-corpus\train\venv\Lib\site-packages\pandas\tests\frame\methods\test_dropna.pyModuleNotFoundError: No module named 'pandas'
ОКРУЖЕНИЕ (нет пакета)$IMPORTS\goblin-corpus\train\venv\Lib\site-packages\pandas\tests\frame\methods\test_dtypes.pyModuleNotFoundError: No module named 'pandas'
ОКРУЖЕНИЕ (нет пакета)$IMPORTS\goblin-corpus\train\venv\Lib\site-packages\pandas\tests\frame\methods\test_duplicated.pyModuleNotFoundError: No module named 'pandas'
ОКРУЖЕНИЕ (нет пакета)$IMPORTS\goblin-corpus\train\venv\Lib\site-packages\pandas\tests\frame\methods\test_equals.pyModuleNotFoundError: No module named 'pandas'
ОКРУЖЕНИЕ (нет пакета)$IMPORTS\goblin-corpus\train\venv\Lib\site-packages\pandas\tests\frame\methods\test_explode.pyModuleNotFoundError: No module named 'pandas'
ОКРУЖЕНИЕ (нет пакета)$IMPORTS\goblin-corpus\train\venv\Lib\site-packages\pandas\tests\frame\methods\test_fillna.pyModuleNotFoundError: No module named 'pandas'
ОКРУЖЕНИЕ (нет пакета)$IMPORTS\goblin-corpus\train\venv\Lib\site-packages\pandas\tests\frame\methods\test_filter.pyModuleNotFoundError: No module named 'pandas'
ОКРУЖЕНИЕ (нет пакета)$IMPORTS\goblin-corpus\train\venv\Lib\site-packages\pandas\tests\frame\methods\test_first_valid_index.pyModuleNotFoundError: No module named 'pandas'
ОКРУЖЕНИЕ (нет пакета)$IMPORTS\goblin-corpus\train\venv\Lib\site-packages\pandas\tests\frame\methods\test_get_numeric_data.pyModuleNotFoundError: No module named 'pandas'
ОКРУЖЕНИЕ (нет пакета)$IMPORTS\goblin-corpus\train\venv\Lib\site-packages\pandas\tests\frame\methods\test_head_tail.pyModuleNotFoundError: No module named 'pandas'
ОКРУЖЕНИЕ (нет пакета)$IMPORTS\goblin-corpus\train\venv\Lib\site-packages\pandas\tests\frame\methods\test_infer_objects.pyModuleNotFoundError: No module named 'pandas'
ОКРУЖЕНИЕ (нет пакета)$IMPORTS\goblin-corpus\train\venv\Lib\site-packages\pandas\tests\frame\methods\test_info.pyModuleNotFoundError: No module named 'pandas'
ОКРУЖЕНИЕ (нет пакета)$IMPORTS\goblin-corpus\train\venv\Lib\site-packages\pandas\tests\frame\methods\test_interpolate.pyModuleNotFoundError: No module named 'pandas'
ОКРУЖЕНИЕ (нет пакета)$IMPORTS\goblin-corpus\train\venv\Lib\site-packages\pandas\tests\frame\methods\test_is_homogeneous_dtype.pyModuleNotFoundError: No module named 'pandas'
ОКРУЖЕНИЕ (нет пакета)$IMPORTS\goblin-corpus\train\venv\Lib\site-packages\pandas\tests\frame\methods\test_isetitem.pyModuleNotFoundError: No module named 'pandas'
ОКРУЖЕНИЕ (нет пакета)$IMPORTS\goblin-corpus\train\venv\Lib\site-packages\pandas\tests\frame\methods\test_isin.pyModuleNotFoundError: No module named 'pandas'
ОКРУЖЕНИЕ (нет пакета)$IMPORTS\goblin-corpus\train\venv\Lib\site-packages\pandas\tests\frame\methods\test_iterrows.pyModuleNotFoundError: No module named 'pandas'
ОКРУЖЕНИЕ (нет пакета)$IMPORTS\goblin-corpus\train\venv\Lib\site-packages\pandas\tests\frame\methods\test_join.pyModuleNotFoundError: No module named 'pandas'
ОКРУЖЕНИЕ (нет пакета)$IMPORTS\goblin-corpus\train\venv\Lib\site-packages\pandas\tests\frame\methods\test_map.pyModuleNotFoundError: No module named 'pandas'
ОКРУЖЕНИЕ (нет пакета)$IMPORTS\goblin-corpus\train\venv\Lib\site-packages\pandas\tests\frame\methods\test_matmul.pyModuleNotFoundError: No module named 'pandas'
ОКРУЖЕНИЕ (нет пакета)$IMPORTS\goblin-corpus\train\venv\Lib\site-packages\pandas\tests\frame\methods\test_nlargest.pyModuleNotFoundError: No module named 'pandas'
ОКРУЖЕНИЕ (нет пакета)$IMPORTS\goblin-corpus\train\venv\Lib\site-packages\pandas\tests\frame\methods\test_pct_change.pyModuleNotFoundError: No module named 'pandas'
ОКРУЖЕНИЕ (нет пакета)$IMPORTS\goblin-corpus\train\venv\Lib\site-packages\pandas\tests\frame\methods\test_pipe.pyModuleNotFoundError: No module named 'pandas'
ОКРУЖЕНИЕ (нет пакета)$IMPORTS\goblin-corpus\train\venv\Lib\site-packages\pandas\tests\frame\methods\test_pop.pyModuleNotFoundError: No module named 'pandas'
ОКРУЖЕНИЕ (нет пакета)$IMPORTS\goblin-corpus\train\venv\Lib\site-packages\pandas\tests\frame\methods\test_quantile.pyModuleNotFoundError: No module named 'pandas'
ОКРУЖЕНИЕ (нет пакета)$IMPORTS\goblin-corpus\train\venv\Lib\site-packages\pandas\tests\frame\methods\test_rank.pyModuleNotFoundError: No module named 'pandas'
ОКРУЖЕНИЕ (нет пакета)$IMPORTS\goblin-corpus\train\venv\Lib\site-packages\pandas\tests\frame\methods\test_reindex.pyModuleNotFoundError: No module named 'pandas'
ОКРУЖЕНИЕ (нет пакета)$IMPORTS\goblin-corpus\train\venv\Lib\site-packages\pandas\tests\frame\methods\test_reindex_like.pyModuleNotFoundError: No module named 'pandas'
ОКРУЖЕНИЕ (нет пакета)$IMPORTS\goblin-corpus\train\venv\Lib\site-packages\pandas\tests\frame\methods\test_rename.pyModuleNotFoundError: No module named 'pandas'
ОКРУЖЕНИЕ (нет пакета)$IMPORTS\goblin-corpus\train\venv\Lib\site-packages\pandas\tests\frame\methods\test_rename_axis.pyModuleNotFoundError: No module named 'pandas'
ОКРУЖЕНИЕ (нет пакета)$IMPORTS\goblin-corpus\train\venv\Lib\site-packages\pandas\tests\frame\methods\test_reorder_levels.pyModuleNotFoundError: No module named 'pandas'
ОКРУЖЕНИЕ (нет пакета)$IMPORTS\goblin-corpus\train\venv\Lib\site-packages\pandas\tests\frame\methods\test_replace.pyModuleNotFoundError: No module named 'pandas'
ОКРУЖЕНИЕ (нет пакета)$IMPORTS\goblin-corpus\train\venv\Lib\site-packages\pandas\tests\frame\methods\test_reset_index.pyModuleNotFoundError: No module named 'pandas'
ОКРУЖЕНИЕ (нет пакета)$IMPORTS\goblin-corpus\train\venv\Lib\site-packages\pandas\tests\frame\methods\test_round.pyModuleNotFoundError: No module named 'pandas'
ОКРУЖЕНИЕ (нет пакета)$IMPORTS\goblin-corpus\train\venv\Lib\site-packages\pandas\tests\frame\methods\test_sample.pyModuleNotFoundError: No module named 'pandas'
ОКРУЖЕНИЕ (нет пакета)$IMPORTS\goblin-corpus\train\venv\Lib\site-packages\pandas\tests\frame\methods\test_select_dtypes.pyModuleNotFoundError: No module named 'pandas'
ОКРУЖЕНИЕ (нет пакета)$IMPORTS\goblin-corpus\train\venv\Lib\site-packages\pandas\tests\frame\methods\test_set_axis.pyModuleNotFoundError: No module named 'pandas'
ОКРУЖЕНИЕ (нет пакета)$IMPORTS\goblin-corpus\train\venv\Lib\site-packages\pandas\tests\frame\methods\test_set_index.pyModuleNotFoundError: No module named 'pandas'
ОКРУЖЕНИЕ (нет пакета)$IMPORTS\goblin-corpus\train\venv\Lib\site-packages\pandas\tests\frame\methods\test_shift.pyModuleNotFoundError: No module named 'pandas'
ОКРУЖЕНИЕ (нет пакета)$IMPORTS\goblin-corpus\train\venv\Lib\site-packages\pandas\tests\frame\methods\test_size.pyModuleNotFoundError: No module named 'pandas'
ОКРУЖЕНИЕ (нет пакета)$IMPORTS\goblin-corpus\train\venv\Lib\site-packages\pandas\tests\frame\methods\test_sort_index.pyModuleNotFoundError: No module named 'pandas'
ОКРУЖЕНИЕ (нет пакета)$IMPORTS\goblin-corpus\train\venv\Lib\site-packages\pandas\tests\frame\methods\test_sort_values.pyModuleNotFoundError: No module named 'pandas'
ОКРУЖЕНИЕ (нет пакета)$IMPORTS\goblin-corpus\train\venv\Lib\site-packages\pandas\tests\frame\methods\test_swaplevel.pyModuleNotFoundError: No module named 'pandas'
ОКРУЖЕНИЕ (нет пакета)$IMPORTS\goblin-corpus\train\venv\Lib\site-packages\pandas\tests\frame\methods\test_to_csv.pyModuleNotFoundError: No module named 'pandas'
ОКРУЖЕНИЕ (нет пакета)$IMPORTS\goblin-corpus\train\venv\Lib\site-packages\pandas\tests\frame\methods\test_to_dict.pyModuleNotFoundError: No module named 'pandas'
ОКРУЖЕНИЕ (нет пакета)$IMPORTS\goblin-corpus\train\venv\Lib\site-packages\pandas\tests\frame\methods\test_to_dict_of_blocks.pyModuleNotFoundError: No module named 'pandas'
ОКРУЖЕНИЕ (нет пакета)$IMPORTS\goblin-corpus\train\venv\Lib\site-packages\pandas\tests\frame\methods\test_to_numpy.pyModuleNotFoundError: No module named 'pandas'
ОКРУЖЕНИЕ (нет пакета)$IMPORTS\goblin-corpus\train\venv\Lib\site-packages\pandas\tests\frame\methods\test_to_period.pyModuleNotFoundError: No module named 'pandas'
ОКРУЖЕНИЕ (нет пакета)$IMPORTS\goblin-corpus\train\venv\Lib\site-packages\pandas\tests\frame\methods\test_to_records.pyModuleNotFoundError: No module named 'pandas'
ОКРУЖЕНИЕ (нет пакета)$IMPORTS\goblin-corpus\train\venv\Lib\site-packages\pandas\tests\frame\methods\test_to_timestamp.pyModuleNotFoundError: No module named 'pandas'
ОКРУЖЕНИЕ (нет пакета)$IMPORTS\goblin-corpus\train\venv\Lib\site-packages\pandas\tests\frame\methods\test_transpose.pyModuleNotFoundError: No module named 'pandas'
ОКРУЖЕНИЕ (нет пакета)$IMPORTS\goblin-corpus\train\venv\Lib\site-packages\pandas\tests\frame\methods\test_truncate.pyModuleNotFoundError: No module named 'pandas'
ОКРУЖЕНИЕ (нет пакета)$IMPORTS\goblin-corpus\train\venv\Lib\site-packages\pandas\tests\frame\methods\test_tz_convert.pyModuleNotFoundError: No module named 'pandas'
ОКРУЖЕНИЕ (нет пакета)$IMPORTS\goblin-corpus\train\venv\Lib\site-packages\pandas\tests\frame\methods\test_tz_localize.pyModuleNotFoundError: No module named 'pandas'
ОКРУЖЕНИЕ (нет пакета)$IMPORTS\goblin-corpus\train\venv\Lib\site-packages\pandas\tests\frame\methods\test_update.pyModuleNotFoundError: No module named 'pandas'
ОКРУЖЕНИЕ (нет пакета)$IMPORTS\goblin-corpus\train\venv\Lib\site-packages\pandas\tests\frame\methods\test_value_counts.pyModuleNotFoundError: No module named 'pandas'
ОКРУЖЕНИЕ (нет пакета)$IMPORTS\goblin-corpus\train\venv\Lib\site-packages\pandas\tests\frame\methods\test_values.pyModuleNotFoundError: No module named 'pandas'
ОКРУЖЕНИЕ (нет пакета)$IMPORTS\goblin-corpus\train\venv\Lib\site-packages\pandas\tests\frame\test_alter_axes.pyModuleNotFoundError: No module named 'pandas'
ОКРУЖЕНИЕ (нет пакета)$IMPORTS\goblin-corpus\train\venv\Lib\site-packages\pandas\tests\frame\test_api.pyModuleNotFoundError: No module named 'pandas'
ОКРУЖЕНИЕ (нет пакета)$IMPORTS\goblin-corpus\train\venv\Lib\site-packages\pandas\tests\frame\test_arithmetic.pyModuleNotFoundError: No module named 'pandas'
ОКРУЖЕНИЕ (нет пакета)$IMPORTS\goblin-corpus\train\venv\Lib\site-packages\pandas\tests\frame\test_arrow_interface.pyModuleNotFoundError: No module named 'pandas'
ОКРУЖЕНИЕ (нет пакета)$IMPORTS\goblin-corpus\train\venv\Lib\site-packages\pandas\tests\frame\test_block_internals.pyModuleNotFoundError: No module named 'pandas'
ОКРУЖЕНИЕ (нет пакета)$IMPORTS\goblin-corpus\train\venv\Lib\site-packages\pandas\tests\frame\test_constructors.pyModuleNotFoundError: No module named 'pandas'
ОКРУЖЕНИЕ (нет пакета)$IMPORTS\goblin-corpus\train\venv\Lib\site-packages\pandas\tests\frame\test_cumulative.pyModuleNotFoundError: No module named 'pandas'
ОКРУЖЕНИЕ (нет пакета)$IMPORTS\goblin-corpus\train\venv\Lib\site-packages\pandas\tests\frame\test_iteration.pyModuleNotFoundError: No module named 'pandas'
ОКРУЖЕНИЕ (нет пакета)$IMPORTS\goblin-corpus\train\venv\Lib\site-packages\pandas\tests\frame\test_logical_ops.pyModuleNotFoundError: No module named 'pandas'
ОКРУЖЕНИЕ (нет пакета)$IMPORTS\goblin-corpus\train\venv\Lib\site-packages\pandas\tests\frame\test_nonunique_indexes.pyModuleNotFoundError: No module named 'pandas'
ОКРУЖЕНИЕ (нет пакета)$IMPORTS\goblin-corpus\train\venv\Lib\site-packages\pandas\tests\frame\test_npfuncs.pyModuleNotFoundError: No module named 'pandas'
ОКРУЖЕНИЕ (нет пакета)$IMPORTS\goblin-corpus\train\venv\Lib\site-packages\pandas\tests\frame\test_query_eval.pyModuleNotFoundError: No module named 'pandas'
ОКРУЖЕНИЕ (нет пакета)$IMPORTS\goblin-corpus\train\venv\Lib\site-packages\pandas\tests\frame\test_reductions.pyModuleNotFoundError: No module named 'pandas'
ОКРУЖЕНИЕ (нет пакета)$IMPORTS\goblin-corpus\train\venv\Lib\site-packages\pandas\tests\frame\test_repr.pyModuleNotFoundError: No module named 'pandas'
ОКРУЖЕНИЕ (нет пакета)$IMPORTS\goblin-corpus\train\venv\Lib\site-packages\pandas\tests\frame\test_stack_unstack.pyModuleNotFoundError: No module named 'pandas'
ОКРУЖЕНИЕ (нет пакета)$IMPORTS\goblin-corpus\train\venv\Lib\site-packages\pandas\tests\frame\test_subclass.pyModuleNotFoundError: No module named 'pandas'
ОКРУЖЕНИЕ (нет пакета)$IMPORTS\goblin-corpus\train\venv\Lib\site-packages\pandas\tests\frame\test_ufunc.pyModuleNotFoundError: No module named 'pandas'
ОКРУЖЕНИЕ (нет пакета)$IMPORTS\goblin-corpus\train\venv\Lib\site-packages\pandas\tests\frame\test_unary.pyModuleNotFoundError: No module named 'pandas'
ОКРУЖЕНИЕ (нет пакета)$IMPORTS\goblin-corpus\train\venv\Lib\site-packages\pandas\tests\frame\test_validate.pyModuleNotFoundError: No module named 'pandas'
ОКРУЖЕНИЕ (нет пакета)$IMPORTS\goblin-corpus\train\venv\Lib\site-packages\pandas\tests\generic\test_duplicate_labels.pyModuleNotFoundError: No module named 'pandas'
ОКРУЖЕНИЕ (нет пакета)$IMPORTS\goblin-corpus\train\venv\Lib\site-packages\pandas\tests\generic\test_finalize.pyModuleNotFoundError: No module named 'pandas'
ОКРУЖЕНИЕ (нет пакета)$IMPORTS\goblin-corpus\train\venv\Lib\site-packages\pandas\tests\generic\test_frame.pyModuleNotFoundError: No module named 'pandas'
ОКРУЖЕНИЕ (нет пакета)$IMPORTS\goblin-corpus\train\venv\Lib\site-packages\pandas\tests\generic\test_generic.pyModuleNotFoundError: No module named 'pandas'
ОКРУЖЕНИЕ (нет пакета)$IMPORTS\goblin-corpus\train\venv\Lib\site-packages\pandas\tests\generic\test_label_or_level_utils.pyModuleNotFoundError: No module named 'pandas'
ОКРУЖЕНИЕ (нет пакета)$IMPORTS\goblin-corpus\train\venv\Lib\site-packages\pandas\tests\generic\test_series.pyModuleNotFoundError: No module named 'pandas'
ОКРУЖЕНИЕ (нет пакета)$IMPORTS\goblin-corpus\train\venv\Lib\site-packages\pandas\tests\generic\test_to_xarray.pyModuleNotFoundError: No module named 'pandas'
ОКРУЖЕНИЕ (нет пакета)$IMPORTS\goblin-corpus\train\venv\Lib\site-packages\pandas\tests\groupby\aggregate\test_aggregate.pyModuleNotFoundError: No module named 'pandas'
ОКРУЖЕНИЕ (нет пакета)$IMPORTS\goblin-corpus\train\venv\Lib\site-packages\pandas\tests\groupby\aggregate\test_cython.pyModuleNotFoundError: No module named 'pandas'
ОКРУЖЕНИЕ (нет пакета)$IMPORTS\goblin-corpus\train\venv\Lib\site-packages\pandas\tests\groupby\aggregate\test_numba.pyModuleNotFoundError: No module named 'pandas'
ОКРУЖЕНИЕ (нет пакета)$IMPORTS\goblin-corpus\train\venv\Lib\site-packages\pandas\tests\groupby\aggregate\test_other.pyModuleNotFoundError: No module named 'pandas'
ОКРУЖЕНИЕ (нет пакета)$IMPORTS\goblin-corpus\train\venv\Lib\site-packages\pandas\tests\groupby\methods\test_describe.pyModuleNotFoundError: No module named 'pandas'
ОКРУЖЕНИЕ (нет пакета)$IMPORTS\goblin-corpus\train\venv\Lib\site-packages\pandas\tests\groupby\methods\test_groupby_shift_diff.pyModuleNotFoundError: No module named 'pandas'
ОКРУЖЕНИЕ (нет пакета)$IMPORTS\goblin-corpus\train\venv\Lib\site-packages\pandas\tests\groupby\methods\test_is_monotonic.pyModuleNotFoundError: No module named 'pandas'
ОКРУЖЕНИЕ (нет пакета)$IMPORTS\goblin-corpus\train\venv\Lib\site-packages\pandas\tests\groupby\methods\test_kurt.pyModuleNotFoundError: No module named 'pandas'
ОКРУЖЕНИЕ (нет пакета)$IMPORTS\goblin-corpus\train\venv\Lib\site-packages\pandas\tests\groupby\methods\test_nlargest_nsmallest.pyModuleNotFoundError: No module named 'pandas'
ОКРУЖЕНИЕ (нет пакета)$IMPORTS\goblin-corpus\train\venv\Lib\site-packages\pandas\tests\groupby\methods\test_nth.pyModuleNotFoundError: No module named 'pandas'
ОКРУЖЕНИЕ (нет пакета)$IMPORTS\goblin-corpus\train\venv\Lib\site-packages\pandas\tests\groupby\methods\test_quantile.pyModuleNotFoundError: No module named 'pandas'
ОКРУЖЕНИЕ (нет пакета)$IMPORTS\goblin-corpus\train\venv\Lib\site-packages\pandas\tests\groupby\methods\test_rank.pyModuleNotFoundError: No module named 'pandas'
ОКРУЖЕНИЕ (нет пакета)$IMPORTS\goblin-corpus\train\venv\Lib\site-packages\pandas\tests\groupby\methods\test_sample.pyModuleNotFoundError: No module named 'pandas'
ОКРУЖЕНИЕ (нет пакета)$IMPORTS\goblin-corpus\train\venv\Lib\site-packages\pandas\tests\groupby\methods\test_size.pyModuleNotFoundError: No module named 'pandas'
ОКРУЖЕНИЕ (нет пакета)$IMPORTS\goblin-corpus\train\venv\Lib\site-packages\pandas\tests\groupby\methods\test_skew.pyModuleNotFoundError: No module named 'pandas'
ОКРУЖЕНИЕ (нет пакета)$IMPORTS\goblin-corpus\train\venv\Lib\site-packages\pandas\tests\groupby\methods\test_value_counts.pyModuleNotFoundError: No module named 'pandas'
ОКРУЖЕНИЕ (нет пакета)$IMPORTS\goblin-corpus\train\venv\Lib\site-packages\pandas\tests\groupby\test_all_methods.pyModuleNotFoundError: No module named 'pandas'
ОКРУЖЕНИЕ (нет пакета)$IMPORTS\goblin-corpus\train\venv\Lib\site-packages\pandas\tests\groupby\test_api.pyModuleNotFoundError: No module named 'pandas'
ОКРУЖЕНИЕ (нет пакета)$IMPORTS\goblin-corpus\train\venv\Lib\site-packages\pandas\tests\groupby\test_apply.pyModuleNotFoundError: No module named 'pandas'
ОКРУЖЕНИЕ (нет пакета)$IMPORTS\goblin-corpus\train\venv\Lib\site-packages\pandas\tests\groupby\test_bin_groupby.pyModuleNotFoundError: No module named 'pandas'
ОКРУЖЕНИЕ (нет пакета)$IMPORTS\goblin-corpus\train\venv\Lib\site-packages\pandas\tests\groupby\test_categorical.pyModuleNotFoundError: No module named 'pandas'
ОКРУЖЕНИЕ (нет пакета)$IMPORTS\goblin-corpus\train\venv\Lib\site-packages\pandas\tests\groupby\test_counting.pyModuleNotFoundError: No module named 'pandas'
ОКРУЖЕНИЕ (нет пакета)$IMPORTS\goblin-corpus\train\venv\Lib\site-packages\pandas\tests\groupby\test_cumulative.pyModuleNotFoundError: No module named 'pandas'
ОКРУЖЕНИЕ (нет пакета)$IMPORTS\goblin-corpus\train\venv\Lib\site-packages\pandas\tests\groupby\test_filters.pyModuleNotFoundError: No module named 'pandas'
ОКРУЖЕНИЕ (нет пакета)$IMPORTS\goblin-corpus\train\venv\Lib\site-packages\pandas\tests\groupby\test_groupby.pyModuleNotFoundError: No module named 'pandas'
ОКРУЖЕНИЕ (нет пакета)$IMPORTS\goblin-corpus\train\venv\Lib\site-packages\pandas\tests\groupby\test_groupby_dropna.pyModuleNotFoundError: No module named 'pandas'
ОКРУЖЕНИЕ (нет пакета)$IMPORTS\goblin-corpus\train\venv\Lib\site-packages\pandas\tests\groupby\test_groupby_subclass.pyModuleNotFoundError: No module named 'pandas'
ОКРУЖЕНИЕ (нет пакета)$IMPORTS\goblin-corpus\train\venv\Lib\site-packages\pandas\tests\groupby\test_grouping.pyModuleNotFoundError: No module named 'pandas'
ОКРУЖЕНИЕ (нет пакета)$IMPORTS\goblin-corpus\train\venv\Lib\site-packages\pandas\tests\groupby\test_index_as_string.pyModuleNotFoundError: No module named 'pandas'
ОКРУЖЕНИЕ (нет пакета)$IMPORTS\goblin-corpus\train\venv\Lib\site-packages\pandas\tests\groupby\test_indexing.pyModuleNotFoundError: No module named 'pandas'
ОКРУЖЕНИЕ (нет пакета)$IMPORTS\goblin-corpus\train\venv\Lib\site-packages\pandas\tests\groupby\test_libgroupby.pyModuleNotFoundError: No module named 'pandas'
ОКРУЖЕНИЕ (нет пакета)$IMPORTS\goblin-corpus\train\venv\Lib\site-packages\pandas\tests\groupby\test_missing.pyModuleNotFoundError: No module named 'pandas'
ОКРУЖЕНИЕ (нет пакета)$IMPORTS\goblin-corpus\train\venv\Lib\site-packages\pandas\tests\groupby\test_numba.pyModuleNotFoundError: No module named 'pandas'
ОКРУЖЕНИЕ (нет пакета)$IMPORTS\goblin-corpus\train\venv\Lib\site-packages\pandas\tests\groupby\test_numeric_only.pyModuleNotFoundError: No module named 'pandas'
ОКРУЖЕНИЕ (нет пакета)$IMPORTS\goblin-corpus\train\venv\Lib\site-packages\pandas\tests\groupby\test_pipe.pyModuleNotFoundError: No module named 'pandas'
ОКРУЖЕНИЕ (нет пакета)$IMPORTS\goblin-corpus\train\venv\Lib\site-packages\pandas\tests\groupby\test_raises.pyModuleNotFoundError: No module named 'pandas'
ОКРУЖЕНИЕ (нет пакета)$IMPORTS\goblin-corpus\train\venv\Lib\site-packages\pandas\tests\groupby\test_reductions.pyModuleNotFoundError: No module named 'pandas'
ОКРУЖЕНИЕ (нет пакета)$IMPORTS\goblin-corpus\train\venv\Lib\site-packages\pandas\tests\groupby\test_timegrouper.pyModuleNotFoundError: No module named 'pandas'
ОКРУЖЕНИЕ (нет пакета)$IMPORTS\goblin-corpus\train\venv\Lib\site-packages\pandas\tests\groupby\transform\test_numba.pyModuleNotFoundError: No module named 'pandas'
ОКРУЖЕНИЕ (нет пакета)$IMPORTS\goblin-corpus\train\venv\Lib\site-packages\pandas\tests\groupby\transform\test_transform.pyModuleNotFoundError: No module named 'pandas'
ОКРУЖЕНИЕ (нет пакета)$IMPORTS\goblin-corpus\train\venv\Lib\site-packages\pandas\tests\indexes\base_class\test_constructors.pyModuleNotFoundError: No module named 'pandas'
ОКРУЖЕНИЕ (нет пакета)$IMPORTS\goblin-corpus\train\venv\Lib\site-packages\pandas\tests\indexes\base_class\test_formats.pyModuleNotFoundError: No module named 'pandas'
ОКРУЖЕНИЕ (нет пакета)$IMPORTS\goblin-corpus\train\venv\Lib\site-packages\pandas\tests\indexes\base_class\test_indexing.pyModuleNotFoundError: No module named 'pandas'
ОКРУЖЕНИЕ (нет пакета)$IMPORTS\goblin-corpus\train\venv\Lib\site-packages\pandas\tests\indexes\base_class\test_pickle.pyModuleNotFoundError: No module named 'pandas'
ОКРУЖЕНИЕ (нет пакета)$IMPORTS\goblin-corpus\train\venv\Lib\site-packages\pandas\tests\indexes\base_class\test_reshape.pyModuleNotFoundError: No module named 'pandas'
ОКРУЖЕНИЕ (нет пакета)$IMPORTS\goblin-corpus\train\venv\Lib\site-packages\pandas\tests\indexes\base_class\test_setops.pyModuleNotFoundError: No module named 'pandas'
ОКРУЖЕНИЕ (нет пакета)$IMPORTS\goblin-corpus\train\venv\Lib\site-packages\pandas\tests\indexes\base_class\test_where.pyModuleNotFoundError: No module named 'pandas'
ОКРУЖЕНИЕ (нет пакета)$IMPORTS\goblin-corpus\train\venv\Lib\site-packages\pandas\tests\indexes\categorical\test_append.pyModuleNotFoundError: No module named 'pandas'
ОКРУЖЕНИЕ (нет пакета)$IMPORTS\goblin-corpus\train\venv\Lib\site-packages\pandas\tests\indexes\categorical\test_astype.pyModuleNotFoundError: No module named 'pandas'
ОКРУЖЕНИЕ (нет пакета)$IMPORTS\goblin-corpus\train\venv\Lib\site-packages\pandas\tests\indexes\categorical\test_category.pyModuleNotFoundError: No module named 'pandas'
ОКРУЖЕНИЕ (нет пакета)$IMPORTS\goblin-corpus\train\venv\Lib\site-packages\pandas\tests\indexes\categorical\test_constructors.pyModuleNotFoundError: No module named 'pandas'
ОКРУЖЕНИЕ (нет пакета)$IMPORTS\goblin-corpus\train\venv\Lib\site-packages\pandas\tests\indexes\categorical\test_equals.pyModuleNotFoundError: No module named 'pandas'
ОКРУЖЕНИЕ (нет пакета)$IMPORTS\goblin-corpus\train\venv\Lib\site-packages\pandas\tests\indexes\categorical\test_fillna.pyModuleNotFoundError: No module named 'pandas'
ОКРУЖЕНИЕ (нет пакета)$IMPORTS\goblin-corpus\train\venv\Lib\site-packages\pandas\tests\indexes\categorical\test_formats.pyModuleNotFoundError: No module named 'pandas'
ОКРУЖЕНИЕ (нет пакета)$IMPORTS\goblin-corpus\train\venv\Lib\site-packages\pandas\tests\indexes\categorical\test_indexing.pyModuleNotFoundError: No module named 'pandas'
ОКРУЖЕНИЕ (нет пакета)$IMPORTS\goblin-corpus\train\venv\Lib\site-packages\pandas\tests\indexes\categorical\test_map.pyModuleNotFoundError: No module named 'pandas'
ОКРУЖЕНИЕ (нет пакета)$IMPORTS\goblin-corpus\train\venv\Lib\site-packages\pandas\tests\indexes\categorical\test_reindex.pyModuleNotFoundError: No module named 'pandas'
ОКРУЖЕНИЕ (нет пакета)$IMPORTS\goblin-corpus\train\venv\Lib\site-packages\pandas\tests\indexes\categorical\test_setops.pyModuleNotFoundError: No module named 'pandas'
ОКРУЖЕНИЕ (нет пакета)$IMPORTS\goblin-corpus\train\venv\Lib\site-packages\pandas\tests\indexes\datetimelike_\test_drop_duplicates.pyModuleNotFoundError: No module named 'pandas'
ОКРУЖЕНИЕ (нет пакета)$IMPORTS\goblin-corpus\train\venv\Lib\site-packages\pandas\tests\indexes\datetimelike_\test_equals.pyModuleNotFoundError: No module named 'pandas'
ОКРУЖЕНИЕ (нет пакета)$IMPORTS\goblin-corpus\train\venv\Lib\site-packages\pandas\tests\indexes\datetimelike_\test_indexing.pyModuleNotFoundError: No module named 'pandas'
ОКРУЖЕНИЕ (нет пакета)$IMPORTS\goblin-corpus\train\venv\Lib\site-packages\pandas\tests\indexes\datetimelike_\test_is_monotonic.pyModuleNotFoundError: No module named 'pandas'
ОКРУЖЕНИЕ (нет пакета)$IMPORTS\goblin-corpus\train\venv\Lib\site-packages\pandas\tests\indexes\datetimelike_\test_nat.pyModuleNotFoundError: No module named 'pandas'
ОКРУЖЕНИЕ (нет пакета)$IMPORTS\goblin-corpus\train\venv\Lib\site-packages\pandas\tests\indexes\datetimelike_\test_sort_values.pyModuleNotFoundError: No module named 'pandas'
ОКРУЖЕНИЕ (нет пакета)$IMPORTS\goblin-corpus\train\venv\Lib\site-packages\pandas\tests\indexes\datetimelike_\test_value_counts.pyModuleNotFoundError: No module named 'pandas'
ОКРУЖЕНИЕ (нет пакета)$IMPORTS\goblin-corpus\train\venv\Lib\site-packages\pandas\tests\indexes\datetimes\methods\test_asof.pyModuleNotFoundError: No module named 'pandas'
ОКРУЖЕНИЕ (нет пакета)$IMPORTS\goblin-corpus\train\venv\Lib\site-packages\pandas\tests\indexes\datetimes\methods\test_astype.pyModuleNotFoundError: No module named 'pandas'
ОКРУЖЕНИЕ (нет пакета)$IMPORTS\goblin-corpus\train\venv\Lib\site-packages\pandas\tests\indexes\datetimes\methods\test_delete.pyModuleNotFoundError: No module named 'pandas'
ОКРУЖЕНИЕ (нет пакета)$IMPORTS\goblin-corpus\train\venv\Lib\site-packages\pandas\tests\indexes\datetimes\methods\test_factorize.pyModuleNotFoundError: No module named 'pandas'
ОКРУЖЕНИЕ (нет пакета)$IMPORTS\goblin-corpus\train\venv\Lib\site-packages\pandas\tests\indexes\datetimes\methods\test_fillna.pyModuleNotFoundError: No module named 'pandas'
ОКРУЖЕНИЕ (нет пакета)$IMPORTS\goblin-corpus\train\venv\Lib\site-packages\pandas\tests\indexes\datetimes\methods\test_insert.pyModuleNotFoundError: No module named 'pandas'
ОКРУЖЕНИЕ (нет пакета)$IMPORTS\goblin-corpus\train\venv\Lib\site-packages\pandas\tests\indexes\datetimes\methods\test_isocalendar.pyModuleNotFoundError: No module named 'pandas'
ОКРУЖЕНИЕ (нет пакета)$IMPORTS\goblin-corpus\train\venv\Lib\site-packages\pandas\tests\indexes\datetimes\methods\test_map.pyModuleNotFoundError: No module named 'pandas'
ОКРУЖЕНИЕ (нет пакета)$IMPORTS\goblin-corpus\train\venv\Lib\site-packages\pandas\tests\indexes\datetimes\methods\test_normalize.pyModuleNotFoundError: No module named 'pandas'
ОКРУЖЕНИЕ (нет пакета)$IMPORTS\goblin-corpus\train\venv\Lib\site-packages\pandas\tests\indexes\datetimes\methods\test_repeat.pyModuleNotFoundError: No module named 'pandas'
ОКРУЖЕНИЕ (нет пакета)$IMPORTS\goblin-corpus\train\venv\Lib\site-packages\pandas\tests\indexes\datetimes\methods\test_resolution.pyModuleNotFoundError: No module named 'pandas'
ОКРУЖЕНИЕ (нет пакета)$IMPORTS\goblin-corpus\train\venv\Lib\site-packages\pandas\tests\indexes\datetimes\methods\test_round.pyModuleNotFoundError: No module named 'pandas'
ОКРУЖЕНИЕ (нет пакета)$IMPORTS\goblin-corpus\train\venv\Lib\site-packages\pandas\tests\indexes\datetimes\methods\test_shift.pyModuleNotFoundError: No module named 'pandas'
ОКРУЖЕНИЕ (нет пакета)$IMPORTS\goblin-corpus\train\venv\Lib\site-packages\pandas\tests\indexes\datetimes\methods\test_snap.pyModuleNotFoundError: No module named 'pandas'
ОКРУЖЕНИЕ (нет пакета)$IMPORTS\goblin-corpus\train\venv\Lib\site-packages\pandas\tests\indexes\datetimes\methods\test_to_frame.pyModuleNotFoundError: No module named 'pandas'
ОКРУЖЕНИЕ (нет пакета)$IMPORTS\goblin-corpus\train\venv\Lib\site-packages\pandas\tests\indexes\datetimes\methods\test_to_julian_date.pyModuleNotFoundError: No module named 'pandas'
ОКРУЖЕНИЕ (нет пакета)$IMPORTS\goblin-corpus\train\venv\Lib\site-packages\pandas\tests\indexes\datetimes\methods\test_to_period.pyModuleNotFoundError: No module named 'pandas'
ОКРУЖЕНИЕ (нет пакета)$IMPORTS\goblin-corpus\train\venv\Lib\site-packages\pandas\tests\indexes\datetimes\methods\test_to_pydatetime.pyModuleNotFoundError: No module named 'pandas'
ОКРУЖЕНИЕ (нет пакета)$IMPORTS\goblin-corpus\train\venv\Lib\site-packages\pandas\tests\indexes\datetimes\methods\test_to_series.pyModuleNotFoundError: No module named 'pandas'
ОКРУЖЕНИЕ (нет пакета)$IMPORTS\goblin-corpus\train\venv\Lib\site-packages\pandas\tests\indexes\datetimes\methods\test_tz_convert.pyModuleNotFoundError: No module named 'pandas'
ОКРУЖЕНИЕ (нет пакета)$IMPORTS\goblin-corpus\train\venv\Lib\site-packages\pandas\tests\indexes\datetimes\methods\test_tz_localize.pyModuleNotFoundError: No module named 'pandas'
ОКРУЖЕНИЕ (нет пакета)$IMPORTS\goblin-corpus\train\venv\Lib\site-packages\pandas\tests\indexes\datetimes\methods\test_unique.pyModuleNotFoundError: No module named 'pandas'
ОКРУЖЕНИЕ (нет пакета)$IMPORTS\goblin-corpus\train\venv\Lib\site-packages\pandas\tests\indexes\datetimes\test_arithmetic.pyModuleNotFoundError: No module named 'pandas'
ОКРУЖЕНИЕ (нет пакета)$IMPORTS\goblin-corpus\train\venv\Lib\site-packages\pandas\tests\indexes\datetimes\test_constructors.pyModuleNotFoundError: No module named 'pandas'
ОКРУЖЕНИЕ (нет пакета)$IMPORTS\goblin-corpus\train\venv\Lib\site-packages\pandas\tests\indexes\datetimes\test_date_range.pyModuleNotFoundError: No module named 'pandas'
ОКРУЖЕНИЕ (нет пакета)$IMPORTS\goblin-corpus\train\venv\Lib\site-packages\pandas\tests\indexes\datetimes\test_datetime.pyModuleNotFoundError: No module named 'pandas'
ОКРУЖЕНИЕ (нет пакета)$IMPORTS\goblin-corpus\train\venv\Lib\site-packages\pandas\tests\indexes\datetimes\test_formats.pyModuleNotFoundError: No module named 'pandas'
ОКРУЖЕНИЕ (нет пакета)$IMPORTS\goblin-corpus\train\venv\Lib\site-packages\pandas\tests\indexes\datetimes\test_freq_attr.pyModuleNotFoundError: No module named 'pandas'
ОКРУЖЕНИЕ (нет пакета)$IMPORTS\goblin-corpus\train\venv\Lib\site-packages\pandas\tests\indexes\datetimes\test_indexing.pyModuleNotFoundError: No module named 'pandas'
ОКРУЖЕНИЕ (нет пакета)$IMPORTS\goblin-corpus\train\venv\Lib\site-packages\pandas\tests\indexes\datetimes\test_iter.pyModuleNotFoundError: No module named 'pandas'
ОКРУЖЕНИЕ (нет пакета)$IMPORTS\goblin-corpus\train\venv\Lib\site-packages\pandas\tests\indexes\datetimes\test_join.pyModuleNotFoundError: No module named 'pandas'
ОКРУЖЕНИЕ (нет пакета)$IMPORTS\goblin-corpus\train\venv\Lib\site-packages\pandas\tests\indexes\datetimes\test_npfuncs.pyModuleNotFoundError: No module named 'pandas'
ОКРУЖЕНИЕ (нет пакета)$IMPORTS\goblin-corpus\train\venv\Lib\site-packages\pandas\tests\indexes\datetimes\test_ops.pyModuleNotFoundError: No module named 'pandas'
ОКРУЖЕНИЕ (нет пакета)$IMPORTS\goblin-corpus\train\venv\Lib\site-packages\pandas\tests\indexes\datetimes\test_partial_slicing.pyModuleNotFoundError: No module named 'pandas'
ОКРУЖЕНИЕ (нет пакета)$IMPORTS\goblin-corpus\train\venv\Lib\site-packages\pandas\tests\indexes\datetimes\test_pickle.pyModuleNotFoundError: No module named 'pandas'
ОКРУЖЕНИЕ (нет пакета)$IMPORTS\goblin-corpus\train\venv\Lib\site-packages\pandas\tests\indexes\datetimes\test_reindex.pyModuleNotFoundError: No module named 'pandas'
ОКРУЖЕНИЕ (нет пакета)$IMPORTS\goblin-corpus\train\venv\Lib\site-packages\pandas\tests\indexes\datetimes\test_scalar_compat.pyModuleNotFoundError: No module named 'hypothesis'
ОКРУЖЕНИЕ (нет пакета)$IMPORTS\goblin-corpus\train\venv\Lib\site-packages\pandas\tests\indexes\datetimes\test_setops.pyModuleNotFoundError: No module named 'pandas'
ОКРУЖЕНИЕ (нет пакета)$IMPORTS\goblin-corpus\train\venv\Lib\site-packages\pandas\tests\indexes\datetimes\test_timezones.pyModuleNotFoundError: No module named 'pandas'
ОКРУЖЕНИЕ (нет пакета)$IMPORTS\goblin-corpus\train\venv\Lib\site-packages\pandas\tests\indexes\interval\test_astype.pyModuleNotFoundError: No module named 'pandas'
ОКРУЖЕНИЕ (нет пакета)$IMPORTS\goblin-corpus\train\venv\Lib\site-packages\pandas\tests\indexes\interval\test_constructors.pyModuleNotFoundError: No module named 'pandas'
ОКРУЖЕНИЕ (нет пакета)$IMPORTS\goblin-corpus\train\venv\Lib\site-packages\pandas\tests\indexes\interval\test_equals.pyModuleNotFoundError: No module named 'pandas'
ОКРУЖЕНИЕ (нет пакета)$IMPORTS\goblin-corpus\train\venv\Lib\site-packages\pandas\tests\indexes\interval\test_formats.pyModuleNotFoundError: No module named 'pandas'
ОКРУЖЕНИЕ (нет пакета)$IMPORTS\goblin-corpus\train\venv\Lib\site-packages\pandas\tests\indexes\interval\test_indexing.pyModuleNotFoundError: No module named 'pandas'
ОКРУЖЕНИЕ (нет пакета)$IMPORTS\goblin-corpus\train\venv\Lib\site-packages\pandas\tests\indexes\interval\test_interval.pyModuleNotFoundError: No module named 'pandas'
ОКРУЖЕНИЕ (нет пакета)$IMPORTS\goblin-corpus\train\venv\Lib\site-packages\pandas\tests\indexes\interval\test_interval_range.pyModuleNotFoundError: No module named 'pandas'
ОКРУЖЕНИЕ (нет пакета)$IMPORTS\goblin-corpus\train\venv\Lib\site-packages\pandas\tests\indexes\interval\test_interval_tree.pyModuleNotFoundError: No module named 'pandas'
ОКРУЖЕНИЕ (нет пакета)$IMPORTS\goblin-corpus\train\venv\Lib\site-packages\pandas\tests\indexes\interval\test_join.pyModuleNotFoundError: No module named 'pandas'
ОКРУЖЕНИЕ (нет пакета)$IMPORTS\goblin-corpus\train\venv\Lib\site-packages\pandas\tests\indexes\interval\test_pickle.pyModuleNotFoundError: No module named 'pandas'
ОКРУЖЕНИЕ (нет пакета)$IMPORTS\goblin-corpus\train\venv\Lib\site-packages\pandas\tests\indexes\interval\test_setops.pyModuleNotFoundError: No module named 'pandas'
ОКРУЖЕНИЕ (нет пакета)$IMPORTS\goblin-corpus\train\venv\Lib\site-packages\pandas\tests\indexes\multi\test_analytics.pyModuleNotFoundError: No module named 'pandas'
ОКРУЖЕНИЕ (нет пакета)$IMPORTS\goblin-corpus\train\venv\Lib\site-packages\pandas\tests\indexes\multi\test_astype.pyModuleNotFoundError: No module named 'pandas'
ОКРУЖЕНИЕ (нет пакета)$IMPORTS\goblin-corpus\train\venv\Lib\site-packages\pandas\tests\indexes\multi\test_compat.pyModuleNotFoundError: No module named 'pandas'
ОКРУЖЕНИЕ (нет пакета)$IMPORTS\goblin-corpus\train\venv\Lib\site-packages\pandas\tests\indexes\multi\test_constructors.pyModuleNotFoundError: No module named 'pandas'
ОКРУЖЕНИЕ (нет пакета)$IMPORTS\goblin-corpus\train\venv\Lib\site-packages\pandas\tests\indexes\multi\test_conversion.pyModuleNotFoundError: No module named 'pandas'
ОКРУЖЕНИЕ (нет пакета)$IMPORTS\goblin-corpus\train\venv\Lib\site-packages\pandas\tests\indexes\multi\test_copy.pyModuleNotFoundError: No module named 'pandas'
ОКРУЖЕНИЕ (нет пакета)$IMPORTS\goblin-corpus\train\venv\Lib\site-packages\pandas\tests\indexes\multi\test_drop.pyModuleNotFoundError: No module named 'pandas'
ОКРУЖЕНИЕ (нет пакета)$IMPORTS\goblin-corpus\train\venv\Lib\site-packages\pandas\tests\indexes\multi\test_duplicates.pyModuleNotFoundError: No module named 'pandas'
ОКРУЖЕНИЕ (нет пакета)$IMPORTS\goblin-corpus\train\venv\Lib\site-packages\pandas\tests\indexes\multi\test_equivalence.pyModuleNotFoundError: No module named 'pandas'
ОКРУЖЕНИЕ (нет пакета)$IMPORTS\goblin-corpus\train\venv\Lib\site-packages\pandas\tests\indexes\multi\test_formats.pyModuleNotFoundError: No module named 'pandas'
ОКРУЖЕНИЕ (нет пакета)$IMPORTS\goblin-corpus\train\venv\Lib\site-packages\pandas\tests\indexes\multi\test_get_level_values.pyModuleNotFoundError: No module named 'pandas'
ОКРУЖЕНИЕ (нет пакета)$IMPORTS\goblin-corpus\train\venv\Lib\site-packages\pandas\tests\indexes\multi\test_get_set.pyModuleNotFoundError: No module named 'pandas'
ОКРУЖЕНИЕ (нет пакета)$IMPORTS\goblin-corpus\train\venv\Lib\site-packages\pandas\tests\indexes\multi\test_indexing.pyModuleNotFoundError: No module named 'pandas'
ОКРУЖЕНИЕ (нет пакета)$IMPORTS\goblin-corpus\train\venv\Lib\site-packages\pandas\tests\indexes\multi\test_integrity.pyModuleNotFoundError: No module named 'pandas'
ОКРУЖЕНИЕ (нет пакета)$IMPORTS\goblin-corpus\train\venv\Lib\site-packages\pandas\tests\indexes\multi\test_isin.pyModuleNotFoundError: No module named 'pandas'
ОКРУЖЕНИЕ (нет пакета)$IMPORTS\goblin-corpus\train\venv\Lib\site-packages\pandas\tests\indexes\multi\test_join.pyModuleNotFoundError: No module named 'pandas'
ОКРУЖЕНИЕ (нет пакета)$IMPORTS\goblin-corpus\train\venv\Lib\site-packages\pandas\tests\indexes\multi\test_lexsort.pyModuleNotFoundError: No module named 'pandas'
ОКРУЖЕНИЕ (нет пакета)$IMPORTS\goblin-corpus\train\venv\Lib\site-packages\pandas\tests\indexes\multi\test_missing.pyModuleNotFoundError: No module named 'pandas'
ОКРУЖЕНИЕ (нет пакета)$IMPORTS\goblin-corpus\train\venv\Lib\site-packages\pandas\tests\indexes\multi\test_monotonic.pyModuleNotFoundError: No module named 'pandas'
ОКРУЖЕНИЕ (нет пакета)$IMPORTS\goblin-corpus\train\venv\Lib\site-packages\pandas\tests\indexes\multi\test_names.pyModuleNotFoundError: No module named 'pandas'
ОКРУЖЕНИЕ (нет пакета)$IMPORTS\goblin-corpus\train\venv\Lib\site-packages\pandas\tests\indexes\multi\test_partial_indexing.pyModuleNotFoundError: No module named 'pandas'
ОКРУЖЕНИЕ (нет пакета)$IMPORTS\goblin-corpus\train\venv\Lib\site-packages\pandas\tests\indexes\multi\test_pickle.pyModuleNotFoundError: No module named 'pandas'
ОКРУЖЕНИЕ (нет пакета)$IMPORTS\goblin-corpus\train\venv\Lib\site-packages\pandas\tests\indexes\multi\test_reindex.pyModuleNotFoundError: No module named 'pandas'
ОКРУЖЕНИЕ (нет пакета)$IMPORTS\goblin-corpus\train\venv\Lib\site-packages\pandas\tests\indexes\multi\test_reshape.pyModuleNotFoundError: No module named 'pandas'
ОКРУЖЕНИЕ (нет пакета)$IMPORTS\goblin-corpus\train\venv\Lib\site-packages\pandas\tests\indexes\multi\test_setops.pyModuleNotFoundError: No module named 'pandas'
ОКРУЖЕНИЕ (нет пакета)$IMPORTS\goblin-corpus\train\venv\Lib\site-packages\pandas\tests\indexes\multi\test_sorting.pyModuleNotFoundError: No module named 'pandas'
ОКРУЖЕНИЕ (нет пакета)$IMPORTS\goblin-corpus\train\venv\Lib\site-packages\pandas\tests\indexes\multi\test_take.pyModuleNotFoundError: No module named 'pandas'
ОКРУЖЕНИЕ (нет пакета)$IMPORTS\goblin-corpus\train\venv\Lib\site-packages\pandas\tests\indexes\multi\test_util.pyModuleNotFoundError: No module named 'pandas'
ОКРУЖЕНИЕ (нет пакета)$IMPORTS\goblin-corpus\train\venv\Lib\site-packages\pandas\tests\indexes\numeric\test_astype.pyModuleNotFoundError: No module named 'pandas'
ОКРУЖЕНИЕ (нет пакета)$IMPORTS\goblin-corpus\train\venv\Lib\site-packages\pandas\tests\indexes\numeric\test_indexing.pyModuleNotFoundError: No module named 'pandas'
ОКРУЖЕНИЕ (нет пакета)$IMPORTS\goblin-corpus\train\venv\Lib\site-packages\pandas\tests\indexes\numeric\test_join.pyModuleNotFoundError: No module named 'pandas'
ОКРУЖЕНИЕ (нет пакета)$IMPORTS\goblin-corpus\train\venv\Lib\site-packages\pandas\tests\indexes\numeric\test_numeric.pyModuleNotFoundError: No module named 'pandas'
ОКРУЖЕНИЕ (нет пакета)$IMPORTS\goblin-corpus\train\venv\Lib\site-packages\pandas\tests\indexes\numeric\test_setops.pyModuleNotFoundError: No module named 'pandas'
ОКРУЖЕНИЕ (нет пакета)$IMPORTS\goblin-corpus\train\venv\Lib\site-packages\pandas\tests\indexes\object\test_astype.pyModuleNotFoundError: No module named 'pandas'
ОКРУЖЕНИЕ (нет пакета)$IMPORTS\goblin-corpus\train\venv\Lib\site-packages\pandas\tests\indexes\object\test_indexing.pyModuleNotFoundError: No module named 'pandas'
ОКРУЖЕНИЕ (нет пакета)$IMPORTS\goblin-corpus\train\venv\Lib\site-packages\pandas\tests\indexes\period\methods\test_asfreq.pyModuleNotFoundError: No module named 'pandas'
ОКРУЖЕНИЕ (нет пакета)$IMPORTS\goblin-corpus\train\venv\Lib\site-packages\pandas\tests\indexes\period\methods\test_astype.pyModuleNotFoundError: No module named 'pandas'
ОКРУЖЕНИЕ (нет пакета)$IMPORTS\goblin-corpus\train\venv\Lib\site-packages\pandas\tests\indexes\period\methods\test_factorize.pyModuleNotFoundError: No module named 'pandas'
ОКРУЖЕНИЕ (нет пакета)$IMPORTS\goblin-corpus\train\venv\Lib\site-packages\pandas\tests\indexes\period\methods\test_fillna.pyModuleNotFoundError: No module named 'pandas'
ОКРУЖЕНИЕ (нет пакета)$IMPORTS\goblin-corpus\train\venv\Lib\site-packages\pandas\tests\indexes\period\methods\test_insert.pyModuleNotFoundError: No module named 'pandas'
ОКРУЖЕНИЕ (нет пакета)$IMPORTS\goblin-corpus\train\venv\Lib\site-packages\pandas\tests\indexes\period\methods\test_is_full.pyModuleNotFoundError: No module named 'pandas'
ОКРУЖЕНИЕ (нет пакета)$IMPORTS\goblin-corpus\train\venv\Lib\site-packages\pandas\tests\indexes\period\methods\test_repeat.pyModuleNotFoundError: No module named 'pandas'
ОКРУЖЕНИЕ (нет пакета)$IMPORTS\goblin-corpus\train\venv\Lib\site-packages\pandas\tests\indexes\period\methods\test_shift.pyModuleNotFoundError: No module named 'pandas'
ОКРУЖЕНИЕ (нет пакета)$IMPORTS\goblin-corpus\train\venv\Lib\site-packages\pandas\tests\indexes\period\methods\test_to_timestamp.pyModuleNotFoundError: No module named 'pandas'
ОКРУЖЕНИЕ (нет пакета)$IMPORTS\goblin-corpus\train\venv\Lib\site-packages\pandas\tests\indexes\period\test_constructors.pyModuleNotFoundError: No module named 'pandas'
ОКРУЖЕНИЕ (нет пакета)$IMPORTS\goblin-corpus\train\venv\Lib\site-packages\pandas\tests\indexes\period\test_formats.pyModuleNotFoundError: No module named 'pandas'
ОКРУЖЕНИЕ (нет пакета)$IMPORTS\goblin-corpus\train\venv\Lib\site-packages\pandas\tests\indexes\period\test_freq_attr.pyModuleNotFoundError: No module named 'pandas'
ОКРУЖЕНИЕ (нет пакета)$IMPORTS\goblin-corpus\train\venv\Lib\site-packages\pandas\tests\indexes\period\test_indexing.pyModuleNotFoundError: No module named 'pandas'
ОКРУЖЕНИЕ (нет пакета)$IMPORTS\goblin-corpus\train\venv\Lib\site-packages\pandas\tests\indexes\period\test_join.pyModuleNotFoundError: No module named 'pandas'
ОКРУЖЕНИЕ (нет пакета)$IMPORTS\goblin-corpus\train\venv\Lib\site-packages\pandas\tests\indexes\period\test_monotonic.pyModuleNotFoundError: No module named 'pandas'
ОКРУЖЕНИЕ (нет пакета)$IMPORTS\goblin-corpus\train\venv\Lib\site-packages\pandas\tests\indexes\period\test_partial_slicing.pyModuleNotFoundError: No module named 'pandas'
ОКРУЖЕНИЕ (нет пакета)$IMPORTS\goblin-corpus\train\venv\Lib\site-packages\pandas\tests\indexes\period\test_period.pyModuleNotFoundError: No module named 'pandas'
ОКРУЖЕНИЕ (нет пакета)$IMPORTS\goblin-corpus\train\venv\Lib\site-packages\pandas\tests\indexes\period\test_period_range.pyModuleNotFoundError: No module named 'pandas'
ОКРУЖЕНИЕ (нет пакета)$IMPORTS\goblin-corpus\train\venv\Lib\site-packages\pandas\tests\indexes\period\test_pickle.pyModuleNotFoundError: No module named 'pandas'
ОКРУЖЕНИЕ (нет пакета)$IMPORTS\goblin-corpus\train\venv\Lib\site-packages\pandas\tests\indexes\period\test_resolution.pyModuleNotFoundError: No module named 'pandas'
ОКРУЖЕНИЕ (нет пакета)$IMPORTS\goblin-corpus\train\venv\Lib\site-packages\pandas\tests\indexes\period\test_scalar_compat.pyModuleNotFoundError: No module named 'pandas'
ОКРУЖЕНИЕ (нет пакета)$IMPORTS\goblin-corpus\train\venv\Lib\site-packages\pandas\tests\indexes\period\test_searchsorted.pyModuleNotFoundError: No module named 'pandas'
ОКРУЖЕНИЕ (нет пакета)$IMPORTS\goblin-corpus\train\venv\Lib\site-packages\pandas\tests\indexes\period\test_setops.pyModuleNotFoundError: No module named 'pandas'
ОКРУЖЕНИЕ (нет пакета)$IMPORTS\goblin-corpus\train\venv\Lib\site-packages\pandas\tests\indexes\period\test_tools.pyModuleNotFoundError: No module named 'pandas'
ОКРУЖЕНИЕ (нет пакета)$IMPORTS\goblin-corpus\train\venv\Lib\site-packages\pandas\tests\indexes\ranges\test_constructors.pyModuleNotFoundError: No module named 'pandas'
ОКРУЖЕНИЕ (нет пакета)$IMPORTS\goblin-corpus\train\venv\Lib\site-packages\pandas\tests\indexes\ranges\test_indexing.pyModuleNotFoundError: No module named 'pandas'
ОКРУЖЕНИЕ (нет пакета)$IMPORTS\goblin-corpus\train\venv\Lib\site-packages\pandas\tests\indexes\ranges\test_join.pyModuleNotFoundError: No module named 'pandas'
ОКРУЖЕНИЕ (нет пакета)$IMPORTS\goblin-corpus\train\venv\Lib\site-packages\pandas\tests\indexes\ranges\test_range.pyModuleNotFoundError: No module named 'pandas'
ОКРУЖЕНИЕ (нет пакета)$IMPORTS\goblin-corpus\train\venv\Lib\site-packages\pandas\tests\indexes\ranges\test_setops.pyModuleNotFoundError: No module named 'hypothesis'
ОКРУЖЕНИЕ (нет пакета)$IMPORTS\goblin-corpus\train\venv\Lib\site-packages\pandas\tests\indexes\string\test_astype.pyModuleNotFoundError: No module named 'pandas'
ОКРУЖЕНИЕ (нет пакета)$IMPORTS\goblin-corpus\train\venv\Lib\site-packages\pandas\tests\indexes\string\test_indexing.pyModuleNotFoundError: No module named 'pandas'
НАШЕ (на разбор)$IMPORTS\goblin-corpus\train\venv\Lib\site-packages\pandas\tests\indexes\test_any_index.pyImportError: cannot import name 'ascii_letters' from 'string' (E:\Obsidian\_imports\goblin-corpus\train\venv\L
НАШЕ (на разбор)$IMPORTS\goblin-corpus\train\venv\Lib\site-packages\pandas\tests\indexes\test_base.pyImportError: cannot import name 'ascii_letters' from 'string' (E:\Obsidian\_imports\goblin-corpus\train\venv\L
НАШЕ (на разбор)$IMPORTS\goblin-corpus\train\venv\Lib\site-packages\pandas\tests\indexes\test_common.pyImportError: cannot import name 'ascii_letters' from 'string' (E:\Obsidian\_imports\goblin-corpus\train\venv\L
НАШЕ (на разбор)$IMPORTS\goblin-corpus\train\venv\Lib\site-packages\pandas\tests\indexes\test_datetimelike.pyImportError: cannot import name 'ascii_letters' from 'string' (E:\Obsidian\_imports\goblin-corpus\train\venv\L
НАШЕ (на разбор)$IMPORTS\goblin-corpus\train\venv\Lib\site-packages\pandas\tests\indexes\test_engines.pyImportError: cannot import name 'ascii_letters' from 'string' (E:\Obsidian\_imports\goblin-corpus\train\venv\L
НАШЕ (на разбор)$IMPORTS\goblin-corpus\train\venv\Lib\site-packages\pandas\tests\indexes\test_frozen.pyImportError: cannot import name 'ascii_letters' from 'string' (E:\Obsidian\_imports\goblin-corpus\train\venv\L
НАШЕ (на разбор)$IMPORTS\goblin-corpus\train\venv\Lib\site-packages\pandas\tests\indexes\test_index_new.pyImportError: cannot import name 'ascii_letters' from 'string' (E:\Obsidian\_imports\goblin-corpus\train\venv\L
НАШЕ (на разбор)$IMPORTS\goblin-corpus\train\venv\Lib\site-packages\pandas\tests\indexes\test_indexing.pyImportError: cannot import name 'ascii_letters' from 'string' (E:\Obsidian\_imports\goblin-corpus\train\venv\L
НАШЕ (на разбор)$IMPORTS\goblin-corpus\train\venv\Lib\site-packages\pandas\tests\indexes\test_numpy_compat.pyImportError: cannot import name 'ascii_letters' from 'string' (E:\Obsidian\_imports\goblin-corpus\train\venv\L
НАШЕ (на разбор)$IMPORTS\goblin-corpus\train\venv\Lib\site-packages\pandas\tests\indexes\test_old_base.pyImportError: cannot import name 'ascii_letters' from 'string' (E:\Obsidian\_imports\goblin-corpus\train\venv\L
НАШЕ (на разбор)$IMPORTS\goblin-corpus\train\venv\Lib\site-packages\pandas\tests\indexes\test_setops.pyImportError: cannot import name 'ascii_letters' from 'string' (E:\Obsidian\_imports\goblin-corpus\train\venv\L
ОКРУЖЕНИЕ (нет пакета)$IMPORTS\goblin-corpus\train\venv\Lib\site-packages\pandas\tests\indexes\test_subclass.pyModuleNotFoundError: No module named 'pandas'
ОКРУЖЕНИЕ (нет пакета)$IMPORTS\goblin-corpus\train\venv\Lib\site-packages\pandas\tests\indexes\timedeltas\methods\test_astype.pyModuleNotFoundError: No module named 'pandas'
ОКРУЖЕНИЕ (нет пакета)$IMPORTS\goblin-corpus\train\venv\Lib\site-packages\pandas\tests\indexes\timedeltas\methods\test_factorize.pyModuleNotFoundError: No module named 'pandas'
ОКРУЖЕНИЕ (нет пакета)$IMPORTS\goblin-corpus\train\venv\Lib\site-packages\pandas\tests\indexes\timedeltas\methods\test_fillna.pyModuleNotFoundError: No module named 'pandas'
ОКРУЖЕНИЕ (нет пакета)$IMPORTS\goblin-corpus\train\venv\Lib\site-packages\pandas\tests\indexes\timedeltas\methods\test_insert.pyModuleNotFoundError: No module named 'pandas'
ОКРУЖЕНИЕ (нет пакета)$IMPORTS\goblin-corpus\train\venv\Lib\site-packages\pandas\tests\indexes\timedeltas\methods\test_repeat.pyModuleNotFoundError: No module named 'pandas'
ОКРУЖЕНИЕ (нет пакета)$IMPORTS\goblin-corpus\train\venv\Lib\site-packages\pandas\tests\indexes\timedeltas\methods\test_shift.pyModuleNotFoundError: No module named 'pandas'
ОКРУЖЕНИЕ (нет пакета)$IMPORTS\goblin-corpus\train\venv\Lib\site-packages\pandas\tests\indexes\timedeltas\test_arithmetic.pyModuleNotFoundError: No module named 'pandas'
ОКРУЖЕНИЕ (нет пакета)$IMPORTS\goblin-corpus\train\venv\Lib\site-packages\pandas\tests\indexes\timedeltas\test_constructors.pyModuleNotFoundError: No module named 'pandas'
ОКРУЖЕНИЕ (нет пакета)$IMPORTS\goblin-corpus\train\venv\Lib\site-packages\pandas\tests\indexes\timedeltas\test_delete.pyModuleNotFoundError: No module named 'pandas'
ОКРУЖЕНИЕ (нет пакета)$IMPORTS\goblin-corpus\train\venv\Lib\site-packages\pandas\tests\indexes\timedeltas\test_formats.pyModuleNotFoundError: No module named 'pandas'
ОКРУЖЕНИЕ (нет пакета)$IMPORTS\goblin-corpus\train\venv\Lib\site-packages\pandas\tests\indexes\timedeltas\test_freq_attr.pyModuleNotFoundError: No module named 'pandas'
ОКРУЖЕНИЕ (нет пакета)$IMPORTS\goblin-corpus\train\venv\Lib\site-packages\pandas\tests\indexes\timedeltas\test_indexing.pyModuleNotFoundError: No module named 'pandas'
ОКРУЖЕНИЕ (нет пакета)$IMPORTS\goblin-corpus\train\venv\Lib\site-packages\pandas\tests\indexes\timedeltas\test_join.pyModuleNotFoundError: No module named 'pandas'
ОКРУЖЕНИЕ (нет пакета)$IMPORTS\goblin-corpus\train\venv\Lib\site-packages\pandas\tests\indexes\timedeltas\test_ops.pyModuleNotFoundError: No module named 'pandas'
ОКРУЖЕНИЕ (нет пакета)$IMPORTS\goblin-corpus\train\venv\Lib\site-packages\pandas\tests\indexes\timedeltas\test_pickle.pyModuleNotFoundError: No module named 'pandas'
ОКРУЖЕНИЕ (нет пакета)$IMPORTS\goblin-corpus\train\venv\Lib\site-packages\pandas\tests\indexes\timedeltas\test_scalar_compat.pyModuleNotFoundError: No module named 'pandas'
ОКРУЖЕНИЕ (нет пакета)$IMPORTS\goblin-corpus\train\venv\Lib\site-packages\pandas\tests\indexes\timedeltas\test_searchsorted.pyModuleNotFoundError: No module named 'pandas'
ОКРУЖЕНИЕ (нет пакета)$IMPORTS\goblin-corpus\train\venv\Lib\site-packages\pandas\tests\indexes\timedeltas\test_setops.pyModuleNotFoundError: No module named 'pandas'
ОКРУЖЕНИЕ (нет пакета)$IMPORTS\goblin-corpus\train\venv\Lib\site-packages\pandas\tests\indexes\timedeltas\test_timedelta.pyModuleNotFoundError: No module named 'pandas'
ОКРУЖЕНИЕ (нет пакета)$IMPORTS\goblin-corpus\train\venv\Lib\site-packages\pandas\tests\indexes\timedeltas\test_timedelta_range.pyModuleNotFoundError: No module named 'pandas'
ОКРУЖЕНИЕ (нет пакета)$IMPORTS\goblin-corpus\train\venv\Lib\site-packages\pandas\tests\indexing\interval\test_interval.pyModuleNotFoundError: No module named 'pandas'
ОКРУЖЕНИЕ (нет пакета)$IMPORTS\goblin-corpus\train\venv\Lib\site-packages\pandas\tests\indexing\interval\test_interval_new.pyModuleNotFoundError: No module named 'pandas'
ОКРУЖЕНИЕ (нет пакета)$IMPORTS\goblin-corpus\train\venv\Lib\site-packages\pandas\tests\indexing\multiindex\test_chaining_and_caching.pyModuleNotFoundError: No module named 'pandas'
ОКРУЖЕНИЕ (нет пакета)$IMPORTS\goblin-corpus\train\venv\Lib\site-packages\pandas\tests\indexing\multiindex\test_datetime.pyModuleNotFoundError: No module named 'pandas'
ОКРУЖЕНИЕ (нет пакета)$IMPORTS\goblin-corpus\train\venv\Lib\site-packages\pandas\tests\indexing\multiindex\test_getitem.pyModuleNotFoundError: No module named 'pandas'
ОКРУЖЕНИЕ (нет пакета)$IMPORTS\goblin-corpus\train\venv\Lib\site-packages\pandas\tests\indexing\multiindex\test_iloc.pyModuleNotFoundError: No module named 'pandas'
ОКРУЖЕНИЕ (нет пакета)$IMPORTS\goblin-corpus\train\venv\Lib\site-packages\pandas\tests\indexing\multiindex\test_indexing_slow.pyModuleNotFoundError: No module named 'pandas'
ОКРУЖЕНИЕ (нет пакета)$IMPORTS\goblin-corpus\train\venv\Lib\site-packages\pandas\tests\indexing\multiindex\test_loc.pyModuleNotFoundError: No module named 'pandas'
ОКРУЖЕНИЕ (нет пакета)$IMPORTS\goblin-corpus\train\venv\Lib\site-packages\pandas\tests\indexing\multiindex\test_multiindex.pyModuleNotFoundError: No module named 'pandas'
ОКРУЖЕНИЕ (нет пакета)$IMPORTS\goblin-corpus\train\venv\Lib\site-packages\pandas\tests\indexing\multiindex\test_partial.pyModuleNotFoundError: No module named 'pandas'
ОКРУЖЕНИЕ (нет пакета)$IMPORTS\goblin-corpus\train\venv\Lib\site-packages\pandas\tests\indexing\multiindex\test_setitem.pyModuleNotFoundError: No module named 'pandas'
ОКРУЖЕНИЕ (нет пакета)$IMPORTS\goblin-corpus\train\venv\Lib\site-packages\pandas\tests\indexing\multiindex\test_slice.pyModuleNotFoundError: No module named 'pandas'
ОКРУЖЕНИЕ (нет пакета)$IMPORTS\goblin-corpus\train\venv\Lib\site-packages\pandas\tests\indexing\multiindex\test_sorted.pyModuleNotFoundError: No module named 'pandas'
ОКРУЖЕНИЕ (нет пакета)$IMPORTS\goblin-corpus\train\venv\Lib\site-packages\pandas\tests\indexing\test_at.pyModuleNotFoundError: No module named 'pandas'
ОКРУЖЕНИЕ (нет пакета)$IMPORTS\goblin-corpus\train\venv\Lib\site-packages\pandas\tests\indexing\test_categorical.pyModuleNotFoundError: No module named 'pandas'
ОКРУЖЕНИЕ (нет пакета)$IMPORTS\goblin-corpus\train\venv\Lib\site-packages\pandas\tests\indexing\test_chaining_and_caching.pyModuleNotFoundError: No module named 'pandas'
ОКРУЖЕНИЕ (нет пакета)$IMPORTS\goblin-corpus\train\venv\Lib\site-packages\pandas\tests\indexing\test_check_indexer.pyModuleNotFoundError: No module named 'pandas'
ОКРУЖЕНИЕ (нет пакета)$IMPORTS\goblin-corpus\train\venv\Lib\site-packages\pandas\tests\indexing\test_coercion.pyModuleNotFoundError: No module named 'pandas'
ОКРУЖЕНИЕ (нет пакета)$IMPORTS\goblin-corpus\train\venv\Lib\site-packages\pandas\tests\indexing\test_datetime.pyModuleNotFoundError: No module named 'pandas'
ОКРУЖЕНИЕ (нет пакета)$IMPORTS\goblin-corpus\train\venv\Lib\site-packages\pandas\tests\indexing\test_floats.pyModuleNotFoundError: No module named 'pandas'
ОКРУЖЕНИЕ (нет пакета)$IMPORTS\goblin-corpus\train\venv\Lib\site-packages\pandas\tests\indexing\test_iat.pyModuleNotFoundError: No module named 'pandas'
ОКРУЖЕНИЕ (нет пакета)$IMPORTS\goblin-corpus\train\venv\Lib\site-packages\pandas\tests\indexing\test_iloc.pyModuleNotFoundError: No module named 'pandas'
ОКРУЖЕНИЕ (нет пакета)$IMPORTS\goblin-corpus\train\venv\Lib\site-packages\pandas\tests\indexing\test_indexers.pyModuleNotFoundError: No module named 'pandas'
ОКРУЖЕНИЕ (нет пакета)$IMPORTS\goblin-corpus\train\venv\Lib\site-packages\pandas\tests\indexing\test_indexing.pyModuleNotFoundError: No module named 'pandas'
ОКРУЖЕНИЕ (нет пакета)$IMPORTS\goblin-corpus\train\venv\Lib\site-packages\pandas\tests\indexing\test_loc.pyModuleNotFoundError: No module named 'pandas'
ОКРУЖЕНИЕ (нет пакета)$IMPORTS\goblin-corpus\train\venv\Lib\site-packages\pandas\tests\indexing\test_na_indexing.pyModuleNotFoundError: No module named 'pandas'
ОКРУЖЕНИЕ (нет пакета)$IMPORTS\goblin-corpus\train\venv\Lib\site-packages\pandas\tests\indexing\test_partial.pyModuleNotFoundError: No module named 'pandas'
ОКРУЖЕНИЕ (нет пакета)$IMPORTS\goblin-corpus\train\venv\Lib\site-packages\pandas\tests\indexing\test_scalar.pyModuleNotFoundError: No module named 'pandas'
ОКРУЖЕНИЕ (нет пакета)$IMPORTS\goblin-corpus\train\venv\Lib\site-packages\pandas\tests\interchange\test_impl.pyModuleNotFoundError: No module named 'pandas'
ОКРУЖЕНИЕ (нет пакета)$IMPORTS\goblin-corpus\train\venv\Lib\site-packages\pandas\tests\interchange\test_spec_conformance.pyModuleNotFoundError: No module named 'pandas'
ОКРУЖЕНИЕ (нет пакета)$IMPORTS\goblin-corpus\train\venv\Lib\site-packages\pandas\tests\interchange\test_utils.pyModuleNotFoundError: No module named 'pandas'
ОКРУЖЕНИЕ (нет пакета)$IMPORTS\goblin-corpus\train\venv\Lib\site-packages\pandas\tests\internals\test_api.pyModuleNotFoundError: No module named 'pandas'
ОКРУЖЕНИЕ (нет пакета)$IMPORTS\goblin-corpus\train\venv\Lib\site-packages\pandas\tests\internals\test_internals.pyModuleNotFoundError: No module named 'pandas'
ОКРУЖЕНИЕ (нет пакета)$IMPORTS\goblin-corpus\train\venv\Lib\site-packages\pandas\tests\io\excel\test_odf.pyModuleNotFoundError: No module named 'pandas'
ОКРУЖЕНИЕ (нет пакета)$IMPORTS\goblin-corpus\train\venv\Lib\site-packages\pandas\tests\io\excel\test_odswriter.pyModuleNotFoundError: No module named 'pandas'
ОКРУЖЕНИЕ (нет пакета)$IMPORTS\goblin-corpus\train\venv\Lib\site-packages\pandas\tests\io\excel\test_openpyxl.pyModuleNotFoundError: No module named 'pandas'
ОКРУЖЕНИЕ (нет пакета)$IMPORTS\goblin-corpus\train\venv\Lib\site-packages\pandas\tests\io\excel\test_readers.pyModuleNotFoundError: No module named 'pandas'
ОКРУЖЕНИЕ (нет пакета)$IMPORTS\goblin-corpus\train\venv\Lib\site-packages\pandas\tests\io\excel\test_style.pyModuleNotFoundError: No module named 'pandas'
ОКРУЖЕНИЕ (нет пакета)$IMPORTS\goblin-corpus\train\venv\Lib\site-packages\pandas\tests\io\excel\test_writers.pyModuleNotFoundError: No module named 'pandas'
ОКРУЖЕНИЕ (нет пакета)$IMPORTS\goblin-corpus\train\venv\Lib\site-packages\pandas\tests\io\excel\test_xlrd.pyModuleNotFoundError: No module named 'pandas'
ОКРУЖЕНИЕ (нет пакета)$IMPORTS\goblin-corpus\train\venv\Lib\site-packages\pandas\tests\io\excel\test_xlsxwriter.pyModuleNotFoundError: No module named 'pandas'
ОКРУЖЕНИЕ (нет пакета)$IMPORTS\goblin-corpus\train\venv\Lib\site-packages\pandas\tests\io\formats\style\test_bar.pyModuleNotFoundError: No module named 'pandas'
ОКРУЖЕНИЕ (нет пакета)$IMPORTS\goblin-corpus\train\venv\Lib\site-packages\pandas\tests\io\formats\style\test_exceptions.pyModuleNotFoundError: No module named 'pandas'
ОКРУЖЕНИЕ (нет пакета)$IMPORTS\goblin-corpus\train\venv\Lib\site-packages\pandas\tests\io\formats\style\test_format.pyModuleNotFoundError: No module named 'pandas'
ОКРУЖЕНИЕ (нет пакета)$IMPORTS\goblin-corpus\train\venv\Lib\site-packages\pandas\tests\io\formats\style\test_highlight.pyModuleNotFoundError: No module named 'pandas'
ОКРУЖЕНИЕ (нет пакета)$IMPORTS\goblin-corpus\train\venv\Lib\site-packages\pandas\tests\io\formats\style\test_html.pyModuleNotFoundError: No module named 'pandas'
ОКРУЖЕНИЕ (нет пакета)$IMPORTS\goblin-corpus\train\venv\Lib\site-packages\pandas\tests\io\formats\style\test_matplotlib.pyModuleNotFoundError: No module named 'pandas'
ОКРУЖЕНИЕ (нет пакета)$IMPORTS\goblin-corpus\train\venv\Lib\site-packages\pandas\tests\io\formats\style\test_non_unique.pyModuleNotFoundError: No module named 'pandas'
ОКРУЖЕНИЕ (нет пакета)$IMPORTS\goblin-corpus\train\venv\Lib\site-packages\pandas\tests\io\formats\style\test_style.pyModuleNotFoundError: No module named 'pandas'
ОКРУЖЕНИЕ (нет пакета)$IMPORTS\goblin-corpus\train\venv\Lib\site-packages\pandas\tests\io\formats\style\test_to_latex.pyModuleNotFoundError: No module named 'pandas'
ОКРУЖЕНИЕ (нет пакета)$IMPORTS\goblin-corpus\train\venv\Lib\site-packages\pandas\tests\io\formats\style\test_to_string.pyModuleNotFoundError: No module named 'pandas'
ОКРУЖЕНИЕ (нет пакета)$IMPORTS\goblin-corpus\train\venv\Lib\site-packages\pandas\tests\io\formats\style\test_to_typst.pyModuleNotFoundError: No module named 'pandas'
ОКРУЖЕНИЕ (нет пакета)$IMPORTS\goblin-corpus\train\venv\Lib\site-packages\pandas\tests\io\formats\style\test_tooltip.pyModuleNotFoundError: No module named 'pandas'
ОКРУЖЕНИЕ (нет пакета)$IMPORTS\goblin-corpus\train\venv\Lib\site-packages\pandas\tests\io\formats\test_console.pyModuleNotFoundError: No module named 'pandas'
ОКРУЖЕНИЕ (нет пакета)$IMPORTS\goblin-corpus\train\venv\Lib\site-packages\pandas\tests\io\formats\test_css.pyModuleNotFoundError: No module named 'pandas'
ОКРУЖЕНИЕ (нет пакета)$IMPORTS\goblin-corpus\train\venv\Lib\site-packages\pandas\tests\io\formats\test_eng_formatting.pyModuleNotFoundError: No module named 'pandas'
ОКРУЖЕНИЕ (нет пакета)$IMPORTS\goblin-corpus\train\venv\Lib\site-packages\pandas\tests\io\formats\test_format.pyModuleNotFoundError: No module named 'pandas'
ОКРУЖЕНИЕ (нет пакета)$IMPORTS\goblin-corpus\train\venv\Lib\site-packages\pandas\tests\io\formats\test_ipython_compat.pyModuleNotFoundError: No module named 'pandas'
ОКРУЖЕНИЕ (нет пакета)$IMPORTS\goblin-corpus\train\venv\Lib\site-packages\pandas\tests\io\formats\test_printing.pyModuleNotFoundError: No module named 'pandas'
ОКРУЖЕНИЕ (нет пакета)$IMPORTS\goblin-corpus\train\venv\Lib\site-packages\pandas\tests\io\formats\test_to_csv.pyModuleNotFoundError: No module named 'pandas'
ОКРУЖЕНИЕ (нет пакета)$IMPORTS\goblin-corpus\train\venv\Lib\site-packages\pandas\tests\io\formats\test_to_excel.pyModuleNotFoundError: No module named 'pandas'
ОКРУЖЕНИЕ (нет пакета)$IMPORTS\goblin-corpus\train\venv\Lib\site-packages\pandas\tests\io\formats\test_to_html.pyModuleNotFoundError: No module named 'pandas'
ОКРУЖЕНИЕ (нет пакета)$IMPORTS\goblin-corpus\train\venv\Lib\site-packages\pandas\tests\io\formats\test_to_latex.pyModuleNotFoundError: No module named 'pandas'
ОКРУЖЕНИЕ (нет пакета)$IMPORTS\goblin-corpus\train\venv\Lib\site-packages\pandas\tests\io\formats\test_to_markdown.pyModuleNotFoundError: No module named 'pandas'
ОКРУЖЕНИЕ (нет пакета)$IMPORTS\goblin-corpus\train\venv\Lib\site-packages\pandas\tests\io\formats\test_to_string.pyModuleNotFoundError: No module named 'pandas'
ОКРУЖЕНИЕ (нет пакета)$IMPORTS\goblin-corpus\train\venv\Lib\site-packages\pandas\tests\io\json\test_compression.pyModuleNotFoundError: No module named 'pandas'
ОКРУЖЕНИЕ (нет пакета)$IMPORTS\goblin-corpus\train\venv\Lib\site-packages\pandas\tests\io\json\test_deprecated_kwargs.pyModuleNotFoundError: No module named 'pandas'
ОКРУЖЕНИЕ (нет пакета)$IMPORTS\goblin-corpus\train\venv\Lib\site-packages\pandas\tests\io\json\test_json_table_schema.pyModuleNotFoundError: No module named 'pandas'
ОКРУЖЕНИЕ (нет пакета)$IMPORTS\goblin-corpus\train\venv\Lib\site-packages\pandas\tests\io\json\test_json_table_schema_ext_dtype.pyModuleNotFoundError: No module named 'pandas'
ОКРУЖЕНИЕ (нет пакета)$IMPORTS\goblin-corpus\train\venv\Lib\site-packages\pandas\tests\io\json\test_normalize.pyModuleNotFoundError: No module named 'pandas'
ОКРУЖЕНИЕ (нет пакета)$IMPORTS\goblin-corpus\train\venv\Lib\site-packages\pandas\tests\io\json\test_pandas.pyModuleNotFoundError: No module named 'pandas'
ОКРУЖЕНИЕ (нет пакета)$IMPORTS\goblin-corpus\train\venv\Lib\site-packages\pandas\tests\io\json\test_readlines.pyModuleNotFoundError: No module named 'pandas'
ОКРУЖЕНИЕ (нет пакета)$IMPORTS\goblin-corpus\train\venv\Lib\site-packages\pandas\tests\io\json\test_ujson.pyModuleNotFoundError: No module named 'pandas'
ОКРУЖЕНИЕ (нет пакета)$IMPORTS\goblin-corpus\train\venv\Lib\site-packages\pandas\tests\io\parser\common\test_chunksize.pyModuleNotFoundError: No module named 'pandas'
ОКРУЖЕНИЕ (нет пакета)$IMPORTS\goblin-corpus\train\venv\Lib\site-packages\pandas\tests\io\parser\common\test_common_basic.pyModuleNotFoundError: No module named 'pandas'
ОКРУЖЕНИЕ (нет пакета)$IMPORTS\goblin-corpus\train\venv\Lib\site-packages\pandas\tests\io\parser\common\test_data_list.pyModuleNotFoundError: No module named 'pandas'
ОКРУЖЕНИЕ (нет пакета)$IMPORTS\goblin-corpus\train\venv\Lib\site-packages\pandas\tests\io\parser\common\test_decimal.pyModuleNotFoundError: No module named 'pandas'
ОКРУЖЕНИЕ (нет пакета)$IMPORTS\goblin-corpus\train\venv\Lib\site-packages\pandas\tests\io\parser\common\test_file_buffer_url.pyModuleNotFoundError: No module named 'pandas'
ОКРУЖЕНИЕ (нет пакета)$IMPORTS\goblin-corpus\train\venv\Lib\site-packages\pandas\tests\io\parser\common\test_float.pyModuleNotFoundError: No module named 'pandas'
ОКРУЖЕНИЕ (нет пакета)$IMPORTS\goblin-corpus\train\venv\Lib\site-packages\pandas\tests\io\parser\common\test_index.pyModuleNotFoundError: No module named 'pandas'
ОКРУЖЕНИЕ (нет пакета)$IMPORTS\goblin-corpus\train\venv\Lib\site-packages\pandas\tests\io\parser\common\test_inf.pyModuleNotFoundError: No module named 'pandas'
ОКРУЖЕНИЕ (нет пакета)$IMPORTS\goblin-corpus\train\venv\Lib\site-packages\pandas\tests\io\parser\common\test_ints.pyModuleNotFoundError: No module named 'pandas'
ОКРУЖЕНИЕ (нет пакета)$IMPORTS\goblin-corpus\train\venv\Lib\site-packages\pandas\tests\io\parser\common\test_iterator.pyModuleNotFoundError: No module named 'pandas'
ОКРУЖЕНИЕ (нет пакета)$IMPORTS\goblin-corpus\train\venv\Lib\site-packages\pandas\tests\io\parser\common\test_read_errors.pyModuleNotFoundError: No module named 'pandas'
ОКРУЖЕНИЕ (нет пакета)$IMPORTS\goblin-corpus\train\venv\Lib\site-packages\pandas\tests\io\parser\dtypes\test_categorical.pyModuleNotFoundError: No module named 'pandas'
ОКРУЖЕНИЕ (нет пакета)$IMPORTS\goblin-corpus\train\venv\Lib\site-packages\pandas\tests\io\parser\dtypes\test_dtypes_basic.pyModuleNotFoundError: No module named 'pandas'
ОКРУЖЕНИЕ (нет пакета)$IMPORTS\goblin-corpus\train\venv\Lib\site-packages\pandas\tests\io\parser\dtypes\test_empty.pyModuleNotFoundError: No module named 'pandas'
ОКРУЖЕНИЕ (нет пакета)$IMPORTS\goblin-corpus\train\venv\Lib\site-packages\pandas\tests\io\parser\test_c_parser_only.pyModuleNotFoundError: No module named 'pandas'
ОКРУЖЕНИЕ (нет пакета)$IMPORTS\goblin-corpus\train\venv\Lib\site-packages\pandas\tests\io\parser\test_comment.pyModuleNotFoundError: No module named 'pandas'
ОКРУЖЕНИЕ (нет пакета)$IMPORTS\goblin-corpus\train\venv\Lib\site-packages\pandas\tests\io\parser\test_compression.pyModuleNotFoundError: No module named 'pandas'
ОКРУЖЕНИЕ (нет пакета)$IMPORTS\goblin-corpus\train\venv\Lib\site-packages\pandas\tests\io\parser\test_concatenate_chunks.pyModuleNotFoundError: No module named 'pandas'
ОКРУЖЕНИЕ (нет пакета)$IMPORTS\goblin-corpus\train\venv\Lib\site-packages\pandas\tests\io\parser\test_converters.pyModuleNotFoundError: No module named 'pandas'
ОКРУЖЕНИЕ (нет пакета)$IMPORTS\goblin-corpus\train\venv\Lib\site-packages\pandas\tests\io\parser\test_dialect.pyModuleNotFoundError: No module named 'pandas'
ОКРУЖЕНИЕ (нет пакета)$IMPORTS\goblin-corpus\train\venv\Lib\site-packages\pandas\tests\io\parser\test_encoding.pyModuleNotFoundError: No module named 'pandas'
ОКРУЖЕНИЕ (нет пакета)$IMPORTS\goblin-corpus\train\venv\Lib\site-packages\pandas\tests\io\parser\test_header.pyModuleNotFoundError: No module named 'pandas'
ОКРУЖЕНИЕ (нет пакета)$IMPORTS\goblin-corpus\train\venv\Lib\site-packages\pandas\tests\io\parser\test_index_col.pyModuleNotFoundError: No module named 'pandas'
ОКРУЖЕНИЕ (нет пакета)$IMPORTS\goblin-corpus\train\venv\Lib\site-packages\pandas\tests\io\parser\test_mangle_dupes.pyModuleNotFoundError: No module named 'pandas'
ОКРУЖЕНИЕ (нет пакета)$IMPORTS\goblin-corpus\train\venv\Lib\site-packages\pandas\tests\io\parser\test_multi_thread.pyModuleNotFoundError: No module named 'pandas'
ОКРУЖЕНИЕ (нет пакета)$IMPORTS\goblin-corpus\train\venv\Lib\site-packages\pandas\tests\io\parser\test_na_values.pyModuleNotFoundError: No module named 'pandas'
ОКРУЖЕНИЕ (нет пакета)$IMPORTS\goblin-corpus\train\venv\Lib\site-packages\pandas\tests\io\parser\test_network.pyModuleNotFoundError: No module named 'pandas'
ОКРУЖЕНИЕ (нет пакета)$IMPORTS\goblin-corpus\train\venv\Lib\site-packages\pandas\tests\io\parser\test_parse_dates.pyModuleNotFoundError: No module named 'pandas'
ОКРУЖЕНИЕ (нет пакета)$IMPORTS\goblin-corpus\train\venv\Lib\site-packages\pandas\tests\io\parser\test_python_parser_only.pyModuleNotFoundError: No module named 'pandas'
ОКРУЖЕНИЕ (нет пакета)$IMPORTS\goblin-corpus\train\venv\Lib\site-packages\pandas\tests\io\parser\test_quoting.pyModuleNotFoundError: No module named 'pandas'
ОКРУЖЕНИЕ (нет пакета)$IMPORTS\goblin-corpus\train\venv\Lib\site-packages\pandas\tests\io\parser\test_read_fwf.pyModuleNotFoundError: No module named 'pandas'
ОКРУЖЕНИЕ (нет пакета)$IMPORTS\goblin-corpus\train\venv\Lib\site-packages\pandas\tests\io\parser\test_skiprows.pyModuleNotFoundError: No module named 'pandas'
ОКРУЖЕНИЕ (нет пакета)$IMPORTS\goblin-corpus\train\venv\Lib\site-packages\pandas\tests\io\parser\test_textreader.pyModuleNotFoundError: No module named 'pandas'
ОКРУЖЕНИЕ (нет пакета)$IMPORTS\goblin-corpus\train\venv\Lib\site-packages\pandas\tests\io\parser\test_unsupported.pyModuleNotFoundError: No module named 'pandas'
ОКРУЖЕНИЕ (нет пакета)$IMPORTS\goblin-corpus\train\venv\Lib\site-packages\pandas\tests\io\parser\test_upcast.pyModuleNotFoundError: No module named 'pandas'
ОКРУЖЕНИЕ (нет пакета)$IMPORTS\goblin-corpus\train\venv\Lib\site-packages\pandas\tests\io\parser\usecols\test_parse_dates.pyModuleNotFoundError: No module named 'pandas'
ОКРУЖЕНИЕ (нет пакета)$IMPORTS\goblin-corpus\train\venv\Lib\site-packages\pandas\tests\io\parser\usecols\test_strings.pyModuleNotFoundError: No module named 'pandas'
ОКРУЖЕНИЕ (нет пакета)$IMPORTS\goblin-corpus\train\venv\Lib\site-packages\pandas\tests\io\parser\usecols\test_usecols_basic.pyModuleNotFoundError: No module named 'pandas'
ОКРУЖЕНИЕ (нет пакета)$IMPORTS\goblin-corpus\train\venv\Lib\site-packages\pandas\tests\io\pytables\test_append.pyModuleNotFoundError: No module named 'pandas'
ОКРУЖЕНИЕ (нет пакета)$IMPORTS\goblin-corpus\train\venv\Lib\site-packages\pandas\tests\io\pytables\test_categorical.pyModuleNotFoundError: No module named 'pandas'
ОКРУЖЕНИЕ (нет пакета)$IMPORTS\goblin-corpus\train\venv\Lib\site-packages\pandas\tests\io\pytables\test_compat.pyModuleNotFoundError: No module named 'pandas'
ОКРУЖЕНИЕ (нет пакета)$IMPORTS\goblin-corpus\train\venv\Lib\site-packages\pandas\tests\io\pytables\test_complex.pyModuleNotFoundError: No module named 'pandas'
ОКРУЖЕНИЕ (нет пакета)$IMPORTS\goblin-corpus\train\venv\Lib\site-packages\pandas\tests\io\pytables\test_errors.pyModuleNotFoundError: No module named 'pandas'
ОКРУЖЕНИЕ (нет пакета)$IMPORTS\goblin-corpus\train\venv\Lib\site-packages\pandas\tests\io\pytables\test_file_handling.pyModuleNotFoundError: No module named 'pandas'
ОКРУЖЕНИЕ (нет пакета)$IMPORTS\goblin-corpus\train\venv\Lib\site-packages\pandas\tests\io\pytables\test_keys.pyModuleNotFoundError: No module named 'pandas'
ОКРУЖЕНИЕ (нет пакета)$IMPORTS\goblin-corpus\train\venv\Lib\site-packages\pandas\tests\io\pytables\test_put.pyModuleNotFoundError: No module named 'pandas'
ОКРУЖЕНИЕ (нет пакета)$IMPORTS\goblin-corpus\train\venv\Lib\site-packages\pandas\tests\io\pytables\test_pytables_missing.pyModuleNotFoundError: No module named 'pandas'
ОКРУЖЕНИЕ (нет пакета)$IMPORTS\goblin-corpus\train\venv\Lib\site-packages\pandas\tests\io\pytables\test_read.pyModuleNotFoundError: No module named 'pandas'
ОКРУЖЕНИЕ (нет пакета)$IMPORTS\goblin-corpus\train\venv\Lib\site-packages\pandas\tests\io\pytables\test_retain_attributes.pyModuleNotFoundError: No module named 'pandas'
ОКРУЖЕНИЕ (нет пакета)$IMPORTS\goblin-corpus\train\venv\Lib\site-packages\pandas\tests\io\pytables\test_round_trip.pyModuleNotFoundError: No module named 'pandas'
ОКРУЖЕНИЕ (нет пакета)$IMPORTS\goblin-corpus\train\venv\Lib\site-packages\pandas\tests\io\pytables\test_select.pyModuleNotFoundError: No module named 'pandas'
ОКРУЖЕНИЕ (нет пакета)$IMPORTS\goblin-corpus\train\venv\Lib\site-packages\pandas\tests\io\pytables\test_store.pyModuleNotFoundError: No module named 'pandas'
ОКРУЖЕНИЕ (нет пакета)$IMPORTS\goblin-corpus\train\venv\Lib\site-packages\pandas\tests\io\pytables\test_subclass.pyModuleNotFoundError: No module named 'pandas'
ОКРУЖЕНИЕ (нет пакета)$IMPORTS\goblin-corpus\train\venv\Lib\site-packages\pandas\tests\io\pytables\test_time_series.pyModuleNotFoundError: No module named 'pandas'
ОКРУЖЕНИЕ (нет пакета)$IMPORTS\goblin-corpus\train\venv\Lib\site-packages\pandas\tests\io\pytables\test_timezones.pyModuleNotFoundError: No module named 'pandas'
ОКРУЖЕНИЕ (нет пакета)$IMPORTS\goblin-corpus\train\venv\Lib\site-packages\pandas\tests\io\sas\test_byteswap.pyModuleNotFoundError: No module named 'hypothesis'
ОКРУЖЕНИЕ (нет пакета)$IMPORTS\goblin-corpus\train\venv\Lib\site-packages\pandas\tests\io\sas\test_sas.pyModuleNotFoundError: No module named 'pandas'
ОКРУЖЕНИЕ (нет пакета)$IMPORTS\goblin-corpus\train\venv\Lib\site-packages\pandas\tests\io\sas\test_sas7bdat.pyModuleNotFoundError: No module named 'pandas'
ОКРУЖЕНИЕ (нет пакета)$IMPORTS\goblin-corpus\train\venv\Lib\site-packages\pandas\tests\io\sas\test_xport.pyModuleNotFoundError: No module named 'pandas'
ОКРУЖЕНИЕ (нет пакета)$IMPORTS\goblin-corpus\train\venv\Lib\site-packages\pandas\tests\io\test_clipboard.pyModuleNotFoundError: No module named 'pandas'
ОКРУЖЕНИЕ (нет пакета)$IMPORTS\goblin-corpus\train\venv\Lib\site-packages\pandas\tests\io\test_common.pyModuleNotFoundError: No module named 'pandas'
ОКРУЖЕНИЕ (нет пакета)$IMPORTS\goblin-corpus\train\venv\Lib\site-packages\pandas\tests\io\test_compression.pyModuleNotFoundError: No module named 'pandas'
ОКРУЖЕНИЕ (нет пакета)$IMPORTS\goblin-corpus\train\venv\Lib\site-packages\pandas\tests\io\test_feather.pyModuleNotFoundError: No module named 'pandas'
ОКРУЖЕНИЕ (нет пакета)$IMPORTS\goblin-corpus\train\venv\Lib\site-packages\pandas\tests\io\test_fsspec.pyModuleNotFoundError: No module named 'pandas'
ОКРУЖЕНИЕ (нет пакета)$IMPORTS\goblin-corpus\train\venv\Lib\site-packages\pandas\tests\io\test_gcs.pyModuleNotFoundError: No module named 'pandas'
ОКРУЖЕНИЕ (нет пакета)$IMPORTS\goblin-corpus\train\venv\Lib\site-packages\pandas\tests\io\test_html.pyModuleNotFoundError: No module named 'pandas'
ОКРУЖЕНИЕ (нет пакета)$IMPORTS\goblin-corpus\train\venv\Lib\site-packages\pandas\tests\io\test_http_headers.pyModuleNotFoundError: No module named 'pandas'
ОКРУЖЕНИЕ (нет пакета)$IMPORTS\goblin-corpus\train\venv\Lib\site-packages\pandas\tests\io\test_iceberg.pyModuleNotFoundError: No module named 'pandas'
ОКРУЖЕНИЕ (нет пакета)$IMPORTS\goblin-corpus\train\venv\Lib\site-packages\pandas\tests\io\test_orc.pyModuleNotFoundError: No module named 'pandas'
ОКРУЖЕНИЕ (нет пакета)$IMPORTS\goblin-corpus\train\venv\Lib\site-packages\pandas\tests\io\test_parquet.pyModuleNotFoundError: No module named 'pandas'
ОКРУЖЕНИЕ (нет пакета)$IMPORTS\goblin-corpus\train\venv\Lib\site-packages\pandas\tests\io\test_pickle.pyModuleNotFoundError: No module named 'pandas'
ОКРУЖЕНИЕ (нет пакета)$IMPORTS\goblin-corpus\train\venv\Lib\site-packages\pandas\tests\io\test_s3.pyModuleNotFoundError: No module named 'pandas'
ОКРУЖЕНИЕ (нет пакета)$IMPORTS\goblin-corpus\train\venv\Lib\site-packages\pandas\tests\io\test_spss.pyModuleNotFoundError: No module named 'pandas'
ОКРУЖЕНИЕ (нет пакета)$IMPORTS\goblin-corpus\train\venv\Lib\site-packages\pandas\tests\io\test_sql.pyModuleNotFoundError: No module named 'pandas'
ОКРУЖЕНИЕ (нет пакета)$IMPORTS\goblin-corpus\train\venv\Lib\site-packages\pandas\tests\io\test_stata.pyModuleNotFoundError: No module named 'pandas'
ОКРУЖЕНИЕ (нет пакета)$IMPORTS\goblin-corpus\train\venv\Lib\site-packages\pandas\tests\io\test_util.pyModuleNotFoundError: No module named 'pandas'
ОКРУЖЕНИЕ (нет пакета)$IMPORTS\goblin-corpus\train\venv\Lib\site-packages\pandas\tests\io\xml\test_to_xml.pyModuleNotFoundError: No module named 'pandas'
ОКРУЖЕНИЕ (нет пакета)$IMPORTS\goblin-corpus\train\venv\Lib\site-packages\pandas\tests\io\xml\test_xml.pyModuleNotFoundError: No module named 'pandas'
ОКРУЖЕНИЕ (нет пакета)$IMPORTS\goblin-corpus\train\venv\Lib\site-packages\pandas\tests\io\xml\test_xml_dtypes.pyModuleNotFoundError: No module named 'pandas'
ОКРУЖЕНИЕ (нет пакета)$IMPORTS\goblin-corpus\train\venv\Lib\site-packages\pandas\tests\libs\test_hashtable.pyModuleNotFoundError: No module named 'pandas'
ОКРУЖЕНИЕ (нет пакета)$IMPORTS\goblin-corpus\train\venv\Lib\site-packages\pandas\tests\libs\test_join.pyModuleNotFoundError: No module named 'pandas'
ОКРУЖЕНИЕ (нет пакета)$IMPORTS\goblin-corpus\train\venv\Lib\site-packages\pandas\tests\libs\test_lib.pyModuleNotFoundError: No module named 'pandas'
ОКРУЖЕНИЕ (нет пакета)$IMPORTS\goblin-corpus\train\venv\Lib\site-packages\pandas\tests\libs\test_libalgos.pyModuleNotFoundError: No module named 'pandas'
ОКРУЖЕНИЕ (нет пакета)$IMPORTS\goblin-corpus\train\venv\Lib\site-packages\pandas\tests\plotting\frame\test_frame.pyModuleNotFoundError: No module named 'pandas'
ОКРУЖЕНИЕ (нет пакета)$IMPORTS\goblin-corpus\train\venv\Lib\site-packages\pandas\tests\plotting\frame\test_frame_color.pyModuleNotFoundError: No module named 'pandas'
ОКРУЖЕНИЕ (нет пакета)$IMPORTS\goblin-corpus\train\venv\Lib\site-packages\pandas\tests\plotting\frame\test_frame_groupby.pyModuleNotFoundError: No module named 'pandas'
ОКРУЖЕНИЕ (нет пакета)$IMPORTS\goblin-corpus\train\venv\Lib\site-packages\pandas\tests\plotting\frame\test_frame_legend.pyModuleNotFoundError: No module named 'pandas'
ОКРУЖЕНИЕ (нет пакета)$IMPORTS\goblin-corpus\train\venv\Lib\site-packages\pandas\tests\plotting\frame\test_frame_subplots.pyModuleNotFoundError: No module named 'pandas'
ОКРУЖЕНИЕ (нет пакета)$IMPORTS\goblin-corpus\train\venv\Lib\site-packages\pandas\tests\plotting\frame\test_hist_box_by.pyModuleNotFoundError: No module named 'pandas'
ОКРУЖЕНИЕ (нет пакета)$IMPORTS\goblin-corpus\train\venv\Lib\site-packages\pandas\tests\plotting\test_backend.pyModuleNotFoundError: No module named 'pandas'
ОКРУЖЕНИЕ (нет пакета)$IMPORTS\goblin-corpus\train\venv\Lib\site-packages\pandas\tests\plotting\test_boxplot_method.pyModuleNotFoundError: No module named 'pandas'
ОКРУЖЕНИЕ (нет пакета)$IMPORTS\goblin-corpus\train\venv\Lib\site-packages\pandas\tests\plotting\test_common.pyModuleNotFoundError: No module named 'pandas'
ОКРУЖЕНИЕ (нет пакета)$IMPORTS\goblin-corpus\train\venv\Lib\site-packages\pandas\tests\plotting\test_converter.pyModuleNotFoundError: No module named 'pandas'
ОКРУЖЕНИЕ (нет пакета)$IMPORTS\goblin-corpus\train\venv\Lib\site-packages\pandas\tests\plotting\test_datetimelike.pyModuleNotFoundError: No module named 'pandas'
ОКРУЖЕНИЕ (нет пакета)$IMPORTS\goblin-corpus\train\venv\Lib\site-packages\pandas\tests\plotting\test_groupby.pyModuleNotFoundError: No module named 'pandas'
ОКРУЖЕНИЕ (нет пакета)$IMPORTS\goblin-corpus\train\venv\Lib\site-packages\pandas\tests\plotting\test_hist_method.pyModuleNotFoundError: No module named 'pandas'
ОКРУЖЕНИЕ (нет пакета)$IMPORTS\goblin-corpus\train\venv\Lib\site-packages\pandas\tests\plotting\test_misc.pyModuleNotFoundError: No module named 'pandas'
ОКРУЖЕНИЕ (нет пакета)$IMPORTS\goblin-corpus\train\venv\Lib\site-packages\pandas\tests\plotting\test_series.pyModuleNotFoundError: No module named 'pandas'
ОКРУЖЕНИЕ (нет пакета)$IMPORTS\goblin-corpus\train\venv\Lib\site-packages\pandas\tests\plotting\test_style.pyModuleNotFoundError: No module named 'pandas'
ОКРУЖЕНИЕ (нет пакета)$IMPORTS\goblin-corpus\train\venv\Lib\site-packages\pandas\tests\reductions\test_reductions.pyModuleNotFoundError: No module named 'pandas'
ОКРУЖЕНИЕ (нет пакета)$IMPORTS\goblin-corpus\train\venv\Lib\site-packages\pandas\tests\reductions\test_stat_reductions.pyModuleNotFoundError: No module named 'pandas'
ОКРУЖЕНИЕ (нет пакета)$IMPORTS\goblin-corpus\train\venv\Lib\site-packages\pandas\tests\resample\test_base.pyModuleNotFoundError: No module named 'pandas'
ОКРУЖЕНИЕ (нет пакета)$IMPORTS\goblin-corpus\train\venv\Lib\site-packages\pandas\tests\resample\test_datetime_index.pyModuleNotFoundError: No module named 'pandas'
ОКРУЖЕНИЕ (нет пакета)$IMPORTS\goblin-corpus\train\venv\Lib\site-packages\pandas\tests\resample\test_period_index.pyModuleNotFoundError: No module named 'pandas'
ОКРУЖЕНИЕ (нет пакета)$IMPORTS\goblin-corpus\train\venv\Lib\site-packages\pandas\tests\resample\test_resample_api.pyModuleNotFoundError: No module named 'pandas'
ОКРУЖЕНИЕ (нет пакета)$IMPORTS\goblin-corpus\train\venv\Lib\site-packages\pandas\tests\resample\test_resampler_grouper.pyModuleNotFoundError: No module named 'pandas'
ОКРУЖЕНИЕ (нет пакета)$IMPORTS\goblin-corpus\train\venv\Lib\site-packages\pandas\tests\resample\test_time_grouper.pyModuleNotFoundError: No module named 'pandas'
ОКРУЖЕНИЕ (нет пакета)$IMPORTS\goblin-corpus\train\venv\Lib\site-packages\pandas\tests\resample\test_timedelta.pyModuleNotFoundError: No module named 'pandas'
ОКРУЖЕНИЕ (нет пакета)$IMPORTS\goblin-corpus\train\venv\Lib\site-packages\pandas\tests\reshape\concat\test_append.pyModuleNotFoundError: No module named 'pandas'
ОКРУЖЕНИЕ (нет пакета)$IMPORTS\goblin-corpus\train\venv\Lib\site-packages\pandas\tests\reshape\concat\test_append_common.pyModuleNotFoundError: No module named 'pandas'
ОКРУЖЕНИЕ (нет пакета)$IMPORTS\goblin-corpus\train\venv\Lib\site-packages\pandas\tests\reshape\concat\test_categorical.pyModuleNotFoundError: No module named 'pandas'
ОКРУЖЕНИЕ (нет пакета)$IMPORTS\goblin-corpus\train\venv\Lib\site-packages\pandas\tests\reshape\concat\test_concat.pyModuleNotFoundError: No module named 'pandas'
ОКРУЖЕНИЕ (нет пакета)$IMPORTS\goblin-corpus\train\venv\Lib\site-packages\pandas\tests\reshape\concat\test_dataframe.pyModuleNotFoundError: No module named 'pandas'
ОКРУЖЕНИЕ (нет пакета)$IMPORTS\goblin-corpus\train\venv\Lib\site-packages\pandas\tests\reshape\concat\test_datetimes.pyModuleNotFoundError: No module named 'pandas'
ОКРУЖЕНИЕ (нет пакета)$IMPORTS\goblin-corpus\train\venv\Lib\site-packages\pandas\tests\reshape\concat\test_empty.pyModuleNotFoundError: No module named 'pandas'
ОКРУЖЕНИЕ (нет пакета)$IMPORTS\goblin-corpus\train\venv\Lib\site-packages\pandas\tests\reshape\concat\test_index.pyModuleNotFoundError: No module named 'pandas'
ОКРУЖЕНИЕ (нет пакета)$IMPORTS\goblin-corpus\train\venv\Lib\site-packages\pandas\tests\reshape\concat\test_invalid.pyModuleNotFoundError: No module named 'pandas'
ОКРУЖЕНИЕ (нет пакета)$IMPORTS\goblin-corpus\train\venv\Lib\site-packages\pandas\tests\reshape\concat\test_series.pyModuleNotFoundError: No module named 'pandas'
ОКРУЖЕНИЕ (нет пакета)$IMPORTS\goblin-corpus\train\venv\Lib\site-packages\pandas\tests\reshape\concat\test_sort.pyModuleNotFoundError: No module named 'pandas'
ОКРУЖЕНИЕ (нет пакета)$IMPORTS\goblin-corpus\train\venv\Lib\site-packages\pandas\tests\reshape\merge\test_join.pyModuleNotFoundError: No module named 'pandas'
ОКРУЖЕНИЕ (нет пакета)$IMPORTS\goblin-corpus\train\venv\Lib\site-packages\pandas\tests\reshape\merge\test_merge.pyModuleNotFoundError: No module named 'pandas'
ОКРУЖЕНИЕ (нет пакета)$IMPORTS\goblin-corpus\train\venv\Lib\site-packages\pandas\tests\reshape\merge\test_merge_antijoin.pyModuleNotFoundError: No module named 'pandas'
ОКРУЖЕНИЕ (нет пакета)$IMPORTS\goblin-corpus\train\venv\Lib\site-packages\pandas\tests\reshape\merge\test_merge_asof.pyModuleNotFoundError: No module named 'pandas'
ОКРУЖЕНИЕ (нет пакета)$IMPORTS\goblin-corpus\train\venv\Lib\site-packages\pandas\tests\reshape\merge\test_merge_cross.pyModuleNotFoundError: No module named 'pandas'
ОКРУЖЕНИЕ (нет пакета)$IMPORTS\goblin-corpus\train\venv\Lib\site-packages\pandas\tests\reshape\merge\test_merge_index_as_string.pyModuleNotFoundError: No module named 'pandas'
ОКРУЖЕНИЕ (нет пакета)$IMPORTS\goblin-corpus\train\venv\Lib\site-packages\pandas\tests\reshape\merge\test_merge_ordered.pyModuleNotFoundError: No module named 'pandas'
ОКРУЖЕНИЕ (нет пакета)$IMPORTS\goblin-corpus\train\venv\Lib\site-packages\pandas\tests\reshape\merge\test_multi.pyModuleNotFoundError: No module named 'pandas'
ОКРУЖЕНИЕ (нет пакета)$IMPORTS\goblin-corpus\train\venv\Lib\site-packages\pandas\tests\reshape\test_crosstab.pyModuleNotFoundError: No module named 'pandas'
ОКРУЖЕНИЕ (нет пакета)$IMPORTS\goblin-corpus\train\venv\Lib\site-packages\pandas\tests\reshape\test_cut.pyModuleNotFoundError: No module named 'pandas'
ОКРУЖЕНИЕ (нет пакета)$IMPORTS\goblin-corpus\train\venv\Lib\site-packages\pandas\tests\reshape\test_from_dummies.pyModuleNotFoundError: No module named 'pandas'
ОКРУЖЕНИЕ (нет пакета)$IMPORTS\goblin-corpus\train\venv\Lib\site-packages\pandas\tests\reshape\test_get_dummies.pyModuleNotFoundError: No module named 'pandas'
ОКРУЖЕНИЕ (нет пакета)$IMPORTS\goblin-corpus\train\venv\Lib\site-packages\pandas\tests\reshape\test_melt.pyModuleNotFoundError: No module named 'pandas'
ОКРУЖЕНИЕ (нет пакета)$IMPORTS\goblin-corpus\train\venv\Lib\site-packages\pandas\tests\reshape\test_pivot.pyModuleNotFoundError: No module named 'pandas'
ОКРУЖЕНИЕ (нет пакета)$IMPORTS\goblin-corpus\train\venv\Lib\site-packages\pandas\tests\reshape\test_pivot_multilevel.pyModuleNotFoundError: No module named 'pandas'
ОКРУЖЕНИЕ (нет пакета)$IMPORTS\goblin-corpus\train\venv\Lib\site-packages\pandas\tests\reshape\test_qcut.pyModuleNotFoundError: No module named 'pandas'
ОКРУЖЕНИЕ (нет пакета)$IMPORTS\goblin-corpus\train\venv\Lib\site-packages\pandas\tests\reshape\test_union_categoricals.pyModuleNotFoundError: No module named 'pandas'
ОКРУЖЕНИЕ (нет пакета)$IMPORTS\goblin-corpus\train\venv\Lib\site-packages\pandas\tests\scalar\interval\test_arithmetic.pyModuleNotFoundError: No module named 'pandas'
ОКРУЖЕНИЕ (нет пакета)$IMPORTS\goblin-corpus\train\venv\Lib\site-packages\pandas\tests\scalar\interval\test_constructors.pyModuleNotFoundError: No module named 'pandas'
ОКРУЖЕНИЕ (нет пакета)$IMPORTS\goblin-corpus\train\venv\Lib\site-packages\pandas\tests\scalar\interval\test_contains.pyModuleNotFoundError: No module named 'pandas'
ОКРУЖЕНИЕ (нет пакета)$IMPORTS\goblin-corpus\train\venv\Lib\site-packages\pandas\tests\scalar\interval\test_formats.pyModuleNotFoundError: No module named 'pandas'
ОКРУЖЕНИЕ (нет пакета)$IMPORTS\goblin-corpus\train\venv\Lib\site-packages\pandas\tests\scalar\interval\test_interval.pyModuleNotFoundError: No module named 'pandas'
ОКРУЖЕНИЕ (нет пакета)$IMPORTS\goblin-corpus\train\venv\Lib\site-packages\pandas\tests\scalar\interval\test_overlaps.pyModuleNotFoundError: No module named 'pandas'
ОКРУЖЕНИЕ (нет пакета)$IMPORTS\goblin-corpus\train\venv\Lib\site-packages\pandas\tests\scalar\period\test_arithmetic.pyModuleNotFoundError: No module named 'pandas'
ОКРУЖЕНИЕ (нет пакета)$IMPORTS\goblin-corpus\train\venv\Lib\site-packages\pandas\tests\scalar\period\test_asfreq.pyModuleNotFoundError: No module named 'pandas'
ОКРУЖЕНИЕ (нет пакета)$IMPORTS\goblin-corpus\train\venv\Lib\site-packages\pandas\tests\scalar\period\test_period.pyModuleNotFoundError: No module named 'pandas'
ОКРУЖЕНИЕ (нет пакета)$IMPORTS\goblin-corpus\train\venv\Lib\site-packages\pandas\tests\scalar\test_na_scalar.pyModuleNotFoundError: No module named 'pandas'
ОКРУЖЕНИЕ (нет пакета)$IMPORTS\goblin-corpus\train\venv\Lib\site-packages\pandas\tests\scalar\test_nat.pyModuleNotFoundError: No module named 'pandas'
ОКРУЖЕНИЕ (нет пакета)$IMPORTS\goblin-corpus\train\venv\Lib\site-packages\pandas\tests\scalar\timedelta\methods\test_as_unit.pyModuleNotFoundError: No module named 'pandas'
ОКРУЖЕНИЕ (нет пакета)$IMPORTS\goblin-corpus\train\venv\Lib\site-packages\pandas\tests\scalar\timedelta\methods\test_round.pyModuleNotFoundError: No module named 'hypothesis'
ОКРУЖЕНИЕ (нет пакета)$IMPORTS\goblin-corpus\train\venv\Lib\site-packages\pandas\tests\scalar\timedelta\test_arithmetic.pyModuleNotFoundError: No module named 'pandas'
ОКРУЖЕНИЕ (нет пакета)$IMPORTS\goblin-corpus\train\venv\Lib\site-packages\pandas\tests\scalar\timedelta\test_constructors.pyModuleNotFoundError: No module named 'pandas'
ОКРУЖЕНИЕ (нет пакета)$IMPORTS\goblin-corpus\train\venv\Lib\site-packages\pandas\tests\scalar\timedelta\test_formats.pyModuleNotFoundError: No module named 'pandas'
ОКРУЖЕНИЕ (нет пакета)$IMPORTS\goblin-corpus\train\venv\Lib\site-packages\pandas\tests\scalar\timedelta\test_timedelta.pyModuleNotFoundError: No module named 'hypothesis'
ОКРУЖЕНИЕ (нет пакета)$IMPORTS\goblin-corpus\train\venv\Lib\site-packages\pandas\tests\scalar\timestamp\methods\test_as_unit.pyModuleNotFoundError: No module named 'pandas'
ОКРУЖЕНИЕ (нет пакета)$IMPORTS\goblin-corpus\train\venv\Lib\site-packages\pandas\tests\scalar\timestamp\methods\test_normalize.pyModuleNotFoundError: No module named 'pandas'
ОКРУЖЕНИЕ (нет пакета)$IMPORTS\goblin-corpus\train\venv\Lib\site-packages\pandas\tests\scalar\timestamp\methods\test_replace.pyModuleNotFoundError: No module named 'pandas'
ОКРУЖЕНИЕ (нет пакета)$IMPORTS\goblin-corpus\train\venv\Lib\site-packages\pandas\tests\scalar\timestamp\methods\test_round.pyModuleNotFoundError: No module named 'hypothesis'
ОКРУЖЕНИЕ (нет пакета)$IMPORTS\goblin-corpus\train\venv\Lib\site-packages\pandas\tests\scalar\timestamp\methods\test_timestamp_method.pyModuleNotFoundError: No module named 'pandas'
ОКРУЖЕНИЕ (нет пакета)$IMPORTS\goblin-corpus\train\venv\Lib\site-packages\pandas\tests\scalar\timestamp\methods\test_to_julian_date.pyModuleNotFoundError: No module named 'pandas'
ОКРУЖЕНИЕ (нет пакета)$IMPORTS\goblin-corpus\train\venv\Lib\site-packages\pandas\tests\scalar\timestamp\methods\test_to_pydatetime.pyModuleNotFoundError: No module named 'pandas'
ОКРУЖЕНИЕ (нет пакета)$IMPORTS\goblin-corpus\train\venv\Lib\site-packages\pandas\tests\scalar\timestamp\methods\test_tz_convert.pyModuleNotFoundError: No module named 'pandas'
ОКРУЖЕНИЕ (нет пакета)$IMPORTS\goblin-corpus\train\venv\Lib\site-packages\pandas\tests\scalar\timestamp\methods\test_tz_localize.pyModuleNotFoundError: No module named 'pandas'
ОКРУЖЕНИЕ (нет пакета)$IMPORTS\goblin-corpus\train\venv\Lib\site-packages\pandas\tests\scalar\timestamp\test_arithmetic.pyModuleNotFoundError: No module named 'pandas'
ОКРУЖЕНИЕ (нет пакета)$IMPORTS\goblin-corpus\train\venv\Lib\site-packages\pandas\tests\scalar\timestamp\test_comparisons.pyModuleNotFoundError: No module named 'pandas'
ОКРУЖЕНИЕ (нет пакета)$IMPORTS\goblin-corpus\train\venv\Lib\site-packages\pandas\tests\scalar\timestamp\test_constructors.pyModuleNotFoundError: No module named 'pandas'
ОКРУЖЕНИЕ (нет пакета)$IMPORTS\goblin-corpus\train\venv\Lib\site-packages\pandas\tests\scalar\timestamp\test_formats.pyModuleNotFoundError: No module named 'pandas'
ОКРУЖЕНИЕ (нет пакета)$IMPORTS\goblin-corpus\train\venv\Lib\site-packages\pandas\tests\scalar\timestamp\test_timestamp.pyModuleNotFoundError: No module named 'hypothesis'
ОКРУЖЕНИЕ (нет пакета)$IMPORTS\goblin-corpus\train\venv\Lib\site-packages\pandas\tests\scalar\timestamp\test_timezones.pyModuleNotFoundError: No module named 'pandas'
ОКРУЖЕНИЕ (нет пакета)$IMPORTS\goblin-corpus\train\venv\Lib\site-packages\pandas\tests\series\accessors\test_cat_accessor.pyModuleNotFoundError: No module named 'pandas'
ОКРУЖЕНИЕ (нет пакета)$IMPORTS\goblin-corpus\train\venv\Lib\site-packages\pandas\tests\series\accessors\test_dt_accessor.pyModuleNotFoundError: No module named 'pandas'
ОКРУЖЕНИЕ (нет пакета)$IMPORTS\goblin-corpus\train\venv\Lib\site-packages\pandas\tests\series\accessors\test_list_accessor.pyModuleNotFoundError: No module named 'pandas'
ОКРУЖЕНИЕ (нет пакета)$IMPORTS\goblin-corpus\train\venv\Lib\site-packages\pandas\tests\series\accessors\test_sparse_accessor.pyModuleNotFoundError: No module named 'pandas'
ОКРУЖЕНИЕ (нет пакета)$IMPORTS\goblin-corpus\train\venv\Lib\site-packages\pandas\tests\series\accessors\test_str_accessor.pyModuleNotFoundError: No module named 'pandas'
ОКРУЖЕНИЕ (нет пакета)$IMPORTS\goblin-corpus\train\venv\Lib\site-packages\pandas\tests\series\accessors\test_struct_accessor.pyModuleNotFoundError: No module named 'pandas'
ОКРУЖЕНИЕ (нет пакета)$IMPORTS\goblin-corpus\train\venv\Lib\site-packages\pandas\tests\series\indexing\test_datetime.pyModuleNotFoundError: No module named 'pandas'
ОКРУЖЕНИЕ (нет пакета)$IMPORTS\goblin-corpus\train\venv\Lib\site-packages\pandas\tests\series\indexing\test_delitem.pyModuleNotFoundError: No module named 'pandas'
ОКРУЖЕНИЕ (нет пакета)$IMPORTS\goblin-corpus\train\venv\Lib\site-packages\pandas\tests\series\indexing\test_get.pyModuleNotFoundError: No module named 'pandas'
ОКРУЖЕНИЕ (нет пакета)$IMPORTS\goblin-corpus\train\venv\Lib\site-packages\pandas\tests\series\indexing\test_getitem.pyModuleNotFoundError: No module named 'pandas'
ОКРУЖЕНИЕ (нет пакета)$IMPORTS\goblin-corpus\train\venv\Lib\site-packages\pandas\tests\series\indexing\test_indexing.pyModuleNotFoundError: No module named 'pandas'
ОКРУЖЕНИЕ (нет пакета)$IMPORTS\goblin-corpus\train\venv\Lib\site-packages\pandas\tests\series\indexing\test_mask.pyModuleNotFoundError: No module named 'pandas'
ОКРУЖЕНИЕ (нет пакета)$IMPORTS\goblin-corpus\train\venv\Lib\site-packages\pandas\tests\series\indexing\test_set_value.pyModuleNotFoundError: No module named 'pandas'
ОКРУЖЕНИЕ (нет пакета)$IMPORTS\goblin-corpus\train\venv\Lib\site-packages\pandas\tests\series\indexing\test_setitem.pyModuleNotFoundError: No module named 'pandas'
ОКРУЖЕНИЕ (нет пакета)$IMPORTS\goblin-corpus\train\venv\Lib\site-packages\pandas\tests\series\indexing\test_take.pyModuleNotFoundError: No module named 'pandas'
ОКРУЖЕНИЕ (нет пакета)$IMPORTS\goblin-corpus\train\venv\Lib\site-packages\pandas\tests\series\indexing\test_where.pyModuleNotFoundError: No module named 'pandas'
ОКРУЖЕНИЕ (нет пакета)$IMPORTS\goblin-corpus\train\venv\Lib\site-packages\pandas\tests\series\indexing\test_xs.pyModuleNotFoundError: No module named 'pandas'
ОКРУЖЕНИЕ (нет пакета)$IMPORTS\goblin-corpus\train\venv\Lib\site-packages\pandas\tests\series\methods\test_add_prefix_suffix.pyModuleNotFoundError: No module named 'pandas'
ОКРУЖЕНИЕ (нет пакета)$IMPORTS\goblin-corpus\train\venv\Lib\site-packages\pandas\tests\series\methods\test_align.pyModuleNotFoundError: No module named 'pandas'
ОКРУЖЕНИЕ (нет пакета)$IMPORTS\goblin-corpus\train\venv\Lib\site-packages\pandas\tests\series\methods\test_argsort.pyModuleNotFoundError: No module named 'pandas'
ОКРУЖЕНИЕ (нет пакета)$IMPORTS\goblin-corpus\train\venv\Lib\site-packages\pandas\tests\series\methods\test_asof.pyModuleNotFoundError: No module named 'pandas'
ОКРУЖЕНИЕ (нет пакета)$IMPORTS\goblin-corpus\train\venv\Lib\site-packages\pandas\tests\series\methods\test_astype.pyModuleNotFoundError: No module named 'pandas'
ОКРУЖЕНИЕ (нет пакета)$IMPORTS\goblin-corpus\train\venv\Lib\site-packages\pandas\tests\series\methods\test_between.pyModuleNotFoundError: No module named 'pandas'
ОКРУЖЕНИЕ (нет пакета)$IMPORTS\goblin-corpus\train\venv\Lib\site-packages\pandas\tests\series\methods\test_case_when.pyModuleNotFoundError: No module named 'pandas'
ОКРУЖЕНИЕ (нет пакета)$IMPORTS\goblin-corpus\train\venv\Lib\site-packages\pandas\tests\series\methods\test_clip.pyModuleNotFoundError: No module named 'pandas'
ОКРУЖЕНИЕ (нет пакета)$IMPORTS\goblin-corpus\train\venv\Lib\site-packages\pandas\tests\series\methods\test_combine.pyModuleNotFoundError: No module named 'pandas'
ОКРУЖЕНИЕ (нет пакета)$IMPORTS\goblin-corpus\train\venv\Lib\site-packages\pandas\tests\series\methods\test_combine_first.pyModuleNotFoundError: No module named 'pandas'
ОКРУЖЕНИЕ (нет пакета)$IMPORTS\goblin-corpus\train\venv\Lib\site-packages\pandas\tests\series\methods\test_compare.pyModuleNotFoundError: No module named 'pandas'
ОКРУЖЕНИЕ (нет пакета)$IMPORTS\goblin-corpus\train\venv\Lib\site-packages\pandas\tests\series\methods\test_convert_dtypes.pyModuleNotFoundError: No module named 'pandas'
ОКРУЖЕНИЕ (нет пакета)$IMPORTS\goblin-corpus\train\venv\Lib\site-packages\pandas\tests\series\methods\test_copy.pyModuleNotFoundError: No module named 'pandas'
ОКРУЖЕНИЕ (нет пакета)$IMPORTS\goblin-corpus\train\venv\Lib\site-packages\pandas\tests\series\methods\test_count.pyModuleNotFoundError: No module named 'pandas'
ОКРУЖЕНИЕ (нет пакета)$IMPORTS\goblin-corpus\train\venv\Lib\site-packages\pandas\tests\series\methods\test_cov_corr.pyModuleNotFoundError: No module named 'pandas'
ОКРУЖЕНИЕ (нет пакета)$IMPORTS\goblin-corpus\train\venv\Lib\site-packages\pandas\tests\series\methods\test_describe.pyModuleNotFoundError: No module named 'pandas'
ОКРУЖЕНИЕ (нет пакета)$IMPORTS\goblin-corpus\train\venv\Lib\site-packages\pandas\tests\series\methods\test_diff.pyModuleNotFoundError: No module named 'pandas'
ОКРУЖЕНИЕ (нет пакета)$IMPORTS\goblin-corpus\train\venv\Lib\site-packages\pandas\tests\series\methods\test_drop.pyModuleNotFoundError: No module named 'pandas'
ОКРУЖЕНИЕ (нет пакета)$IMPORTS\goblin-corpus\train\venv\Lib\site-packages\pandas\tests\series\methods\test_drop_duplicates.pyModuleNotFoundError: No module named 'pandas'
ОКРУЖЕНИЕ (нет пакета)$IMPORTS\goblin-corpus\train\venv\Lib\site-packages\pandas\tests\series\methods\test_dropna.pyModuleNotFoundError: No module named 'pandas'
ОКРУЖЕНИЕ (нет пакета)$IMPORTS\goblin-corpus\train\venv\Lib\site-packages\pandas\tests\series\methods\test_duplicated.pyModuleNotFoundError: No module named 'pandas'
ОКРУЖЕНИЕ (нет пакета)$IMPORTS\goblin-corpus\train\venv\Lib\site-packages\pandas\tests\series\methods\test_equals.pyModuleNotFoundError: No module named 'pandas'
ОКРУЖЕНИЕ (нет пакета)$IMPORTS\goblin-corpus\train\venv\Lib\site-packages\pandas\tests\series\methods\test_explode.pyModuleNotFoundError: No module named 'pandas'
ОКРУЖЕНИЕ (нет пакета)$IMPORTS\goblin-corpus\train\venv\Lib\site-packages\pandas\tests\series\methods\test_fillna.pyModuleNotFoundError: No module named 'pandas'
ОКРУЖЕНИЕ (нет пакета)$IMPORTS\goblin-corpus\train\venv\Lib\site-packages\pandas\tests\series\methods\test_get_numeric_data.pyModuleNotFoundError: No module named 'pandas'
ОКРУЖЕНИЕ (нет пакета)$IMPORTS\goblin-corpus\train\venv\Lib\site-packages\pandas\tests\series\methods\test_head_tail.pyModuleNotFoundError: No module named 'pandas'
ОКРУЖЕНИЕ (нет пакета)$IMPORTS\goblin-corpus\train\venv\Lib\site-packages\pandas\tests\series\methods\test_infer_objects.pyModuleNotFoundError: No module named 'pandas'
ОКРУЖЕНИЕ (нет пакета)$IMPORTS\goblin-corpus\train\venv\Lib\site-packages\pandas\tests\series\methods\test_info.pyModuleNotFoundError: No module named 'pandas'
ОКРУЖЕНИЕ (нет пакета)$IMPORTS\goblin-corpus\train\venv\Lib\site-packages\pandas\tests\series\methods\test_interpolate.pyModuleNotFoundError: No module named 'pandas'
ОКРУЖЕНИЕ (нет пакета)$IMPORTS\goblin-corpus\train\venv\Lib\site-packages\pandas\tests\series\methods\test_is_monotonic.pyModuleNotFoundError: No module named 'pandas'
ОКРУЖЕНИЕ (нет пакета)$IMPORTS\goblin-corpus\train\venv\Lib\site-packages\pandas\tests\series\methods\test_is_unique.pyModuleNotFoundError: No module named 'pandas'
ОКРУЖЕНИЕ (нет пакета)$IMPORTS\goblin-corpus\train\venv\Lib\site-packages\pandas\tests\series\methods\test_isin.pyModuleNotFoundError: No module named 'pandas'
ОКРУЖЕНИЕ (нет пакета)$IMPORTS\goblin-corpus\train\venv\Lib\site-packages\pandas\tests\series\methods\test_isna.pyModuleNotFoundError: No module named 'pandas'
ОКРУЖЕНИЕ (нет пакета)$IMPORTS\goblin-corpus\train\venv\Lib\site-packages\pandas\tests\series\methods\test_item.pyModuleNotFoundError: No module named 'pandas'
ОКРУЖЕНИЕ (нет пакета)$IMPORTS\goblin-corpus\train\venv\Lib\site-packages\pandas\tests\series\methods\test_map.pyModuleNotFoundError: No module named 'pandas'
ОКРУЖЕНИЕ (нет пакета)$IMPORTS\goblin-corpus\train\venv\Lib\site-packages\pandas\tests\series\methods\test_matmul.pyModuleNotFoundError: No module named 'pandas'
ОКРУЖЕНИЕ (нет пакета)$IMPORTS\goblin-corpus\train\venv\Lib\site-packages\pandas\tests\series\methods\test_nlargest.pyModuleNotFoundError: No module named 'pandas'
ОКРУЖЕНИЕ (нет пакета)$IMPORTS\goblin-corpus\train\venv\Lib\site-packages\pandas\tests\series\methods\test_nunique.pyModuleNotFoundError: No module named 'pandas'
ОКРУЖЕНИЕ (нет пакета)$IMPORTS\goblin-corpus\train\venv\Lib\site-packages\pandas\tests\series\methods\test_pct_change.pyModuleNotFoundError: No module named 'pandas'
ОКРУЖЕНИЕ (нет пакета)$IMPORTS\goblin-corpus\train\venv\Lib\site-packages\pandas\tests\series\methods\test_pop.pyModuleNotFoundError: No module named 'pandas'
ОКРУЖЕНИЕ (нет пакета)$IMPORTS\goblin-corpus\train\venv\Lib\site-packages\pandas\tests\series\methods\test_quantile.pyModuleNotFoundError: No module named 'pandas'
ОКРУЖЕНИЕ (нет пакета)$IMPORTS\goblin-corpus\train\venv\Lib\site-packages\pandas\tests\series\methods\test_rank.pyModuleNotFoundError: No module named 'pandas'
ОКРУЖЕНИЕ (нет пакета)$IMPORTS\goblin-corpus\train\venv\Lib\site-packages\pandas\tests\series\methods\test_reindex.pyModuleNotFoundError: No module named 'pandas'
ОКРУЖЕНИЕ (нет пакета)$IMPORTS\goblin-corpus\train\venv\Lib\site-packages\pandas\tests\series\methods\test_reindex_like.pyModuleNotFoundError: No module named 'pandas'
ОКРУЖЕНИЕ (нет пакета)$IMPORTS\goblin-corpus\train\venv\Lib\site-packages\pandas\tests\series\methods\test_rename.pyModuleNotFoundError: No module named 'pandas'
ОКРУЖЕНИЕ (нет пакета)$IMPORTS\goblin-corpus\train\venv\Lib\site-packages\pandas\tests\series\methods\test_rename_axis.pyModuleNotFoundError: No module named 'pandas'
ОКРУЖЕНИЕ (нет пакета)$IMPORTS\goblin-corpus\train\venv\Lib\site-packages\pandas\tests\series\methods\test_repeat.pyModuleNotFoundError: No module named 'pandas'
ОКРУЖЕНИЕ (нет пакета)$IMPORTS\goblin-corpus\train\venv\Lib\site-packages\pandas\tests\series\methods\test_replace.pyModuleNotFoundError: No module named 'pandas'
ОКРУЖЕНИЕ (нет пакета)$IMPORTS\goblin-corpus\train\venv\Lib\site-packages\pandas\tests\series\methods\test_reset_index.pyModuleNotFoundError: No module named 'pandas'
ОКРУЖЕНИЕ (нет пакета)$IMPORTS\goblin-corpus\train\venv\Lib\site-packages\pandas\tests\series\methods\test_round.pyModuleNotFoundError: No module named 'pandas'
ОКРУЖЕНИЕ (нет пакета)$IMPORTS\goblin-corpus\train\venv\Lib\site-packages\pandas\tests\series\methods\test_searchsorted.pyModuleNotFoundError: No module named 'pandas'
ОКРУЖЕНИЕ (нет пакета)$IMPORTS\goblin-corpus\train\venv\Lib\site-packages\pandas\tests\series\methods\test_set_name.pyModuleNotFoundError: No module named 'pandas'
ОКРУЖЕНИЕ (нет пакета)$IMPORTS\goblin-corpus\train\venv\Lib\site-packages\pandas\tests\series\methods\test_size.pyModuleNotFoundError: No module named 'pandas'
ОКРУЖЕНИЕ (нет пакета)$IMPORTS\goblin-corpus\train\venv\Lib\site-packages\pandas\tests\series\methods\test_sort_index.pyModuleNotFoundError: No module named 'pandas'
ОКРУЖЕНИЕ (нет пакета)$IMPORTS\goblin-corpus\train\venv\Lib\site-packages\pandas\tests\series\methods\test_sort_values.pyModuleNotFoundError: No module named 'pandas'
ОКРУЖЕНИЕ (нет пакета)$IMPORTS\goblin-corpus\train\venv\Lib\site-packages\pandas\tests\series\methods\test_to_csv.pyModuleNotFoundError: No module named 'pandas'
ОКРУЖЕНИЕ (нет пакета)$IMPORTS\goblin-corpus\train\venv\Lib\site-packages\pandas\tests\series\methods\test_to_dict.pyModuleNotFoundError: No module named 'pandas'
ОКРУЖЕНИЕ (нет пакета)$IMPORTS\goblin-corpus\train\venv\Lib\site-packages\pandas\tests\series\methods\test_to_frame.pyModuleNotFoundError: No module named 'pandas'
ОКРУЖЕНИЕ (нет пакета)$IMPORTS\goblin-corpus\train\venv\Lib\site-packages\pandas\tests\series\methods\test_to_numpy.pyModuleNotFoundError: No module named 'pandas'
ОКРУЖЕНИЕ (нет пакета)$IMPORTS\goblin-corpus\train\venv\Lib\site-packages\pandas\tests\series\methods\test_tolist.pyModuleNotFoundError: No module named 'pandas'
ОКРУЖЕНИЕ (нет пакета)$IMPORTS\goblin-corpus\train\venv\Lib\site-packages\pandas\tests\series\methods\test_truncate.pyModuleNotFoundError: No module named 'pandas'
ОКРУЖЕНИЕ (нет пакета)$IMPORTS\goblin-corpus\train\venv\Lib\site-packages\pandas\tests\series\methods\test_tz_localize.pyModuleNotFoundError: No module named 'pandas'
ОКРУЖЕНИЕ (нет пакета)$IMPORTS\goblin-corpus\train\venv\Lib\site-packages\pandas\tests\series\methods\test_unique.pyModuleNotFoundError: No module named 'pandas'
ОКРУЖЕНИЕ (нет пакета)$IMPORTS\goblin-corpus\train\venv\Lib\site-packages\pandas\tests\series\methods\test_unstack.pyModuleNotFoundError: No module named 'pandas'
ОКРУЖЕНИЕ (нет пакета)$IMPORTS\goblin-corpus\train\venv\Lib\site-packages\pandas\tests\series\methods\test_update.pyModuleNotFoundError: No module named 'pandas'
ОКРУЖЕНИЕ (нет пакета)$IMPORTS\goblin-corpus\train\venv\Lib\site-packages\pandas\tests\series\methods\test_value_counts.pyModuleNotFoundError: No module named 'pandas'
ОКРУЖЕНИЕ (нет пакета)$IMPORTS\goblin-corpus\train\venv\Lib\site-packages\pandas\tests\series\methods\test_values.pyModuleNotFoundError: No module named 'pandas'
ОКРУЖЕНИЕ (нет пакета)$IMPORTS\goblin-corpus\train\venv\Lib\site-packages\pandas\tests\series\test_api.pyModuleNotFoundError: No module named 'pandas'
ОКРУЖЕНИЕ (нет пакета)$IMPORTS\goblin-corpus\train\venv\Lib\site-packages\pandas\tests\series\test_arithmetic.pyModuleNotFoundError: No module named 'pandas'
ОКРУЖЕНИЕ (нет пакета)$IMPORTS\goblin-corpus\train\venv\Lib\site-packages\pandas\tests\series\test_arrow_interface.pyModuleNotFoundError: No module named 'pandas'
ОКРУЖЕНИЕ (нет пакета)$IMPORTS\goblin-corpus\train\venv\Lib\site-packages\pandas\tests\series\test_constructors.pyModuleNotFoundError: No module named 'pandas'
ОКРУЖЕНИЕ (нет пакета)$IMPORTS\goblin-corpus\train\venv\Lib\site-packages\pandas\tests\series\test_cumulative.pyModuleNotFoundError: No module named 'pandas'
ОКРУЖЕНИЕ (нет пакета)$IMPORTS\goblin-corpus\train\venv\Lib\site-packages\pandas\tests\series\test_formats.pyModuleNotFoundError: No module named 'pandas'
ОКРУЖЕНИЕ (нет пакета)$IMPORTS\goblin-corpus\train\venv\Lib\site-packages\pandas\tests\series\test_logical_ops.pyModuleNotFoundError: No module named 'pandas'
ОКРУЖЕНИЕ (нет пакета)$IMPORTS\goblin-corpus\train\venv\Lib\site-packages\pandas\tests\series\test_missing.pyModuleNotFoundError: No module named 'pandas'
ОКРУЖЕНИЕ (нет пакета)$IMPORTS\goblin-corpus\train\venv\Lib\site-packages\pandas\tests\series\test_npfuncs.pyModuleNotFoundError: No module named 'pandas'
ОКРУЖЕНИЕ (нет пакета)$IMPORTS\goblin-corpus\train\venv\Lib\site-packages\pandas\tests\series\test_reductions.pyModuleNotFoundError: No module named 'pandas'
ОКРУЖЕНИЕ (нет пакета)$IMPORTS\goblin-corpus\train\venv\Lib\site-packages\pandas\tests\series\test_subclass.pyModuleNotFoundError: No module named 'pandas'
ОКРУЖЕНИЕ (нет пакета)$IMPORTS\goblin-corpus\train\venv\Lib\site-packages\pandas\tests\series\test_ufunc.pyModuleNotFoundError: No module named 'pandas'
ОКРУЖЕНИЕ (нет пакета)$IMPORTS\goblin-corpus\train\venv\Lib\site-packages\pandas\tests\series\test_unary.pyModuleNotFoundError: No module named 'pandas'
ОКРУЖЕНИЕ (нет пакета)$IMPORTS\goblin-corpus\train\venv\Lib\site-packages\pandas\tests\strings\test_api.pyModuleNotFoundError: No module named 'pandas'
ОКРУЖЕНИЕ (нет пакета)$IMPORTS\goblin-corpus\train\venv\Lib\site-packages\pandas\tests\strings\test_case_justify.pyModuleNotFoundError: No module named 'pandas'
ОКРУЖЕНИЕ (нет пакета)$IMPORTS\goblin-corpus\train\venv\Lib\site-packages\pandas\tests\strings\test_cat.pyModuleNotFoundError: No module named 'pandas'
ОКРУЖЕНИЕ (нет пакета)$IMPORTS\goblin-corpus\train\venv\Lib\site-packages\pandas\tests\strings\test_extract.pyModuleNotFoundError: No module named 'pandas'
ОКРУЖЕНИЕ (нет пакета)$IMPORTS\goblin-corpus\train\venv\Lib\site-packages\pandas\tests\strings\test_find_replace.pyModuleNotFoundError: No module named 'pandas'
ОКРУЖЕНИЕ (нет пакета)$IMPORTS\goblin-corpus\train\venv\Lib\site-packages\pandas\tests\strings\test_get_dummies.pyModuleNotFoundError: No module named 'pandas'
ОКРУЖЕНИЕ (нет пакета)$IMPORTS\goblin-corpus\train\venv\Lib\site-packages\pandas\tests\strings\test_split_partition.pyModuleNotFoundError: No module named 'pandas'
ОКРУЖЕНИЕ (нет пакета)$IMPORTS\goblin-corpus\train\venv\Lib\site-packages\pandas\tests\strings\test_string_array.pyModuleNotFoundError: No module named 'pandas'
ОКРУЖЕНИЕ (нет пакета)$IMPORTS\goblin-corpus\train\venv\Lib\site-packages\pandas\tests\strings\test_strings.pyModuleNotFoundError: No module named 'pandas'
ОКРУЖЕНИЕ (нет пакета)$IMPORTS\goblin-corpus\train\venv\Lib\site-packages\pandas\tests\test_aggregation.pyModuleNotFoundError: No module named 'pandas'
ОКРУЖЕНИЕ (нет пакета)$IMPORTS\goblin-corpus\train\venv\Lib\site-packages\pandas\tests\test_algos.pyModuleNotFoundError: No module named 'pandas'
ОКРУЖЕНИЕ (нет пакета)$IMPORTS\goblin-corpus\train\venv\Lib\site-packages\pandas\tests\test_col.pyModuleNotFoundError: No module named 'pandas'
ОКРУЖЕНИЕ (нет пакета)$IMPORTS\goblin-corpus\train\venv\Lib\site-packages\pandas\tests\test_common.pyModuleNotFoundError: No module named 'pandas'
ОКРУЖЕНИЕ (нет пакета)$IMPORTS\goblin-corpus\train\venv\Lib\site-packages\pandas\tests\test_downstream.pyModuleNotFoundError: No module named 'pandas'
ОКРУЖЕНИЕ (нет пакета)$IMPORTS\goblin-corpus\train\venv\Lib\site-packages\pandas\tests\test_errors.pyModuleNotFoundError: No module named 'pandas'
ОКРУЖЕНИЕ (нет пакета)$IMPORTS\goblin-corpus\train\venv\Lib\site-packages\pandas\tests\test_expressions.pyModuleNotFoundError: No module named 'pandas'
ОКРУЖЕНИЕ (нет пакета)$IMPORTS\goblin-corpus\train\venv\Lib\site-packages\pandas\tests\test_flags.pyModuleNotFoundError: No module named 'pandas'
ОКРУЖЕНИЕ (нет пакета)$IMPORTS\goblin-corpus\train\venv\Lib\site-packages\pandas\tests\test_multilevel.pyModuleNotFoundError: No module named 'pandas'
ОКРУЖЕНИЕ (нет пакета)$IMPORTS\goblin-corpus\train\venv\Lib\site-packages\pandas\tests\test_nanops.pyModuleNotFoundError: No module named 'pandas'
ОКРУЖЕНИЕ (нет пакета)$IMPORTS\goblin-corpus\train\venv\Lib\site-packages\pandas\tests\test_optional_dependency.pyModuleNotFoundError: No module named 'pandas'
ОКРУЖЕНИЕ (нет пакета)$IMPORTS\goblin-corpus\train\venv\Lib\site-packages\pandas\tests\test_register_accessor.pyModuleNotFoundError: No module named 'pandas'
ОКРУЖЕНИЕ (нет пакета)$IMPORTS\goblin-corpus\train\venv\Lib\site-packages\pandas\tests\test_sorting.pyModuleNotFoundError: No module named 'pandas'
ОКРУЖЕНИЕ (нет пакета)$IMPORTS\goblin-corpus\train\venv\Lib\site-packages\pandas\tests\test_take.pyModuleNotFoundError: No module named 'pandas'
ОКРУЖЕНИЕ (нет пакета)$IMPORTS\goblin-corpus\train\venv\Lib\site-packages\pandas\tests\tools\test_to_datetime.pyModuleNotFoundError: No module named 'pandas'
ОКРУЖЕНИЕ (нет пакета)$IMPORTS\goblin-corpus\train\venv\Lib\site-packages\pandas\tests\tools\test_to_numeric.pyModuleNotFoundError: No module named 'pandas'
ОКРУЖЕНИЕ (нет пакета)$IMPORTS\goblin-corpus\train\venv\Lib\site-packages\pandas\tests\tools\test_to_time.pyModuleNotFoundError: No module named 'pandas'
ОКРУЖЕНИЕ (нет пакета)$IMPORTS\goblin-corpus\train\venv\Lib\site-packages\pandas\tests\tools\test_to_timedelta.pyModuleNotFoundError: No module named 'pandas'
ОКРУЖЕНИЕ (нет пакета)$IMPORTS\goblin-corpus\train\venv\Lib\site-packages\pandas\tests\tseries\frequencies\test_freq_code.pyModuleNotFoundError: No module named 'pandas'
ОКРУЖЕНИЕ (нет пакета)$IMPORTS\goblin-corpus\train\venv\Lib\site-packages\pandas\tests\tseries\frequencies\test_frequencies.pyModuleNotFoundError: No module named 'pandas'
ОКРУЖЕНИЕ (нет пакета)$IMPORTS\goblin-corpus\train\venv\Lib\site-packages\pandas\tests\tseries\frequencies\test_inference.pyModuleNotFoundError: No module named 'pandas'
ОКРУЖЕНИЕ (нет пакета)$IMPORTS\goblin-corpus\train\venv\Lib\site-packages\pandas\tests\tseries\holiday\test_calendar.pyModuleNotFoundError: No module named 'pandas'
ОКРУЖЕНИЕ (нет пакета)$IMPORTS\goblin-corpus\train\venv\Lib\site-packages\pandas\tests\tseries\holiday\test_federal.pyModuleNotFoundError: No module named 'pandas'
ОКРУЖЕНИЕ (нет пакета)$IMPORTS\goblin-corpus\train\venv\Lib\site-packages\pandas\tests\tseries\holiday\test_holiday.pyModuleNotFoundError: No module named 'pandas'
ОКРУЖЕНИЕ (нет пакета)$IMPORTS\goblin-corpus\train\venv\Lib\site-packages\pandas\tests\tseries\holiday\test_observance.pyModuleNotFoundError: No module named 'pandas'
ОКРУЖЕНИЕ (нет пакета)$IMPORTS\goblin-corpus\train\venv\Lib\site-packages\pandas\tests\tseries\offsets\test_business_day.pyModuleNotFoundError: No module named 'pandas'
ОКРУЖЕНИЕ (нет пакета)$IMPORTS\goblin-corpus\train\venv\Lib\site-packages\pandas\tests\tseries\offsets\test_business_halfyear.pyModuleNotFoundError: No module named 'pandas'
ОКРУЖЕНИЕ (нет пакета)$IMPORTS\goblin-corpus\train\venv\Lib\site-packages\pandas\tests\tseries\offsets\test_business_hour.pyModuleNotFoundError: No module named 'pandas'
ОКРУЖЕНИЕ (нет пакета)$IMPORTS\goblin-corpus\train\venv\Lib\site-packages\pandas\tests\tseries\offsets\test_business_month.pyModuleNotFoundError: No module named 'pandas'
ОКРУЖЕНИЕ (нет пакета)$IMPORTS\goblin-corpus\train\venv\Lib\site-packages\pandas\tests\tseries\offsets\test_business_quarter.pyModuleNotFoundError: No module named 'pandas'
ОКРУЖЕНИЕ (нет пакета)$IMPORTS\goblin-corpus\train\venv\Lib\site-packages\pandas\tests\tseries\offsets\test_business_year.pyModuleNotFoundError: No module named 'pandas'
ОКРУЖЕНИЕ (нет пакета)$IMPORTS\goblin-corpus\train\venv\Lib\site-packages\pandas\tests\tseries\offsets\test_common.pyModuleNotFoundError: No module named 'pandas'
ОКРУЖЕНИЕ (нет пакета)$IMPORTS\goblin-corpus\train\venv\Lib\site-packages\pandas\tests\tseries\offsets\test_custom_business_day.pyModuleNotFoundError: No module named 'pandas'
ОКРУЖЕНИЕ (нет пакета)$IMPORTS\goblin-corpus\train\venv\Lib\site-packages\pandas\tests\tseries\offsets\test_custom_business_hour.pyModuleNotFoundError: No module named 'pandas'
ОКРУЖЕНИЕ (нет пакета)$IMPORTS\goblin-corpus\train\venv\Lib\site-packages\pandas\tests\tseries\offsets\test_custom_business_month.pyModuleNotFoundError: No module named 'pandas'
ОКРУЖЕНИЕ (нет пакета)$IMPORTS\goblin-corpus\train\venv\Lib\site-packages\pandas\tests\tseries\offsets\test_dst.pyModuleNotFoundError: No module named 'pandas'
ОКРУЖЕНИЕ (нет пакета)$IMPORTS\goblin-corpus\train\venv\Lib\site-packages\pandas\tests\tseries\offsets\test_easter.pyModuleNotFoundError: No module named 'pandas'
ОКРУЖЕНИЕ (нет пакета)$IMPORTS\goblin-corpus\train\venv\Lib\site-packages\pandas\tests\tseries\offsets\test_fiscal.pyModuleNotFoundError: No module named 'pandas'
ОКРУЖЕНИЕ (нет пакета)$IMPORTS\goblin-corpus\train\venv\Lib\site-packages\pandas\tests\tseries\offsets\test_halfyear.pyModuleNotFoundError: No module named 'pandas'
ОКРУЖЕНИЕ (нет пакета)$IMPORTS\goblin-corpus\train\venv\Lib\site-packages\pandas\tests\tseries\offsets\test_index.pyModuleNotFoundError: No module named 'pandas'
ОКРУЖЕНИЕ (нет пакета)$IMPORTS\goblin-corpus\train\venv\Lib\site-packages\pandas\tests\tseries\offsets\test_month.pyModuleNotFoundError: No module named 'pandas'
ОКРУЖЕНИЕ (нет пакета)$IMPORTS\goblin-corpus\train\venv\Lib\site-packages\pandas\tests\tseries\offsets\test_offsets.pyModuleNotFoundError: No module named 'pandas'
ОКРУЖЕНИЕ (нет пакета)$IMPORTS\goblin-corpus\train\venv\Lib\site-packages\pandas\tests\tseries\offsets\test_offsets_properties.pyModuleNotFoundError: No module named 'hypothesis'
ОКРУЖЕНИЕ (нет пакета)$IMPORTS\goblin-corpus\train\venv\Lib\site-packages\pandas\tests\tseries\offsets\test_quarter.pyModuleNotFoundError: No module named 'pandas'
ОКРУЖЕНИЕ (нет пакета)$IMPORTS\goblin-corpus\train\venv\Lib\site-packages\pandas\tests\tseries\offsets\test_ticks.pyModuleNotFoundError: No module named 'hypothesis'
ОКРУЖЕНИЕ (нет пакета)$IMPORTS\goblin-corpus\train\venv\Lib\site-packages\pandas\tests\tseries\offsets\test_week.pyModuleNotFoundError: No module named 'pandas'
ОКРУЖЕНИЕ (нет пакета)$IMPORTS\goblin-corpus\train\venv\Lib\site-packages\pandas\tests\tseries\offsets\test_year.pyModuleNotFoundError: No module named 'pandas'
ОКРУЖЕНИЕ (нет пакета)$IMPORTS\goblin-corpus\train\venv\Lib\site-packages\pandas\tests\tslibs\test_api.pyModuleNotFoundError: No module named 'pandas'
ОКРУЖЕНИЕ (нет пакета)$IMPORTS\goblin-corpus\train\venv\Lib\site-packages\pandas\tests\tslibs\test_array_to_datetime.pyModuleNotFoundError: No module named 'pandas'
ОКРУЖЕНИЕ (нет пакета)$IMPORTS\goblin-corpus\train\venv\Lib\site-packages\pandas\tests\tslibs\test_ccalendar.pyModuleNotFoundError: No module named 'hypothesis'
ОКРУЖЕНИЕ (нет пакета)$IMPORTS\goblin-corpus\train\venv\Lib\site-packages\pandas\tests\tslibs\test_conversion.pyModuleNotFoundError: No module named 'pandas'
ОКРУЖЕНИЕ (нет пакета)$IMPORTS\goblin-corpus\train\venv\Lib\site-packages\pandas\tests\tslibs\test_fields.pyModuleNotFoundError: No module named 'pandas'
ОКРУЖЕНИЕ (нет пакета)$IMPORTS\goblin-corpus\train\venv\Lib\site-packages\pandas\tests\tslibs\test_libfrequencies.pyModuleNotFoundError: No module named 'pandas'
ОКРУЖЕНИЕ (нет пакета)$IMPORTS\goblin-corpus\train\venv\Lib\site-packages\pandas\tests\tslibs\test_liboffsets.pyModuleNotFoundError: No module named 'pandas'
ОКРУЖЕНИЕ (нет пакета)$IMPORTS\goblin-corpus\train\venv\Lib\site-packages\pandas\tests\tslibs\test_np_datetime.pyModuleNotFoundError: No module named 'pandas'
ОКРУЖЕНИЕ (нет пакета)$IMPORTS\goblin-corpus\train\venv\Lib\site-packages\pandas\tests\tslibs\test_npy_units.pyModuleNotFoundError: No module named 'pandas'
ОКРУЖЕНИЕ (нет пакета)$IMPORTS\goblin-corpus\train\venv\Lib\site-packages\pandas\tests\tslibs\test_parse_iso8601.pyModuleNotFoundError: No module named 'pandas'
ОКРУЖЕНИЕ (нет пакета)$IMPORTS\goblin-corpus\train\venv\Lib\site-packages\pandas\tests\tslibs\test_parsing.pyModuleNotFoundError: No module named 'pandas'
ОКРУЖЕНИЕ (нет пакета)$IMPORTS\goblin-corpus\train\venv\Lib\site-packages\pandas\tests\tslibs\test_period.pyModuleNotFoundError: No module named 'pandas'
ОКРУЖЕНИЕ (нет пакета)$IMPORTS\goblin-corpus\train\venv\Lib\site-packages\pandas\tests\tslibs\test_resolution.pyModuleNotFoundError: No module named 'pandas'
ОКРУЖЕНИЕ (нет пакета)$IMPORTS\goblin-corpus\train\venv\Lib\site-packages\pandas\tests\tslibs\test_strptime.pyModuleNotFoundError: No module named 'pandas'
ОКРУЖЕНИЕ (нет пакета)$IMPORTS\goblin-corpus\train\venv\Lib\site-packages\pandas\tests\tslibs\test_timedeltas.pyModuleNotFoundError: No module named 'pandas'
ОКРУЖЕНИЕ (нет пакета)$IMPORTS\goblin-corpus\train\venv\Lib\site-packages\pandas\tests\tslibs\test_timezones.pyModuleNotFoundError: No module named 'pandas'
ОКРУЖЕНИЕ (нет пакета)$IMPORTS\goblin-corpus\train\venv\Lib\site-packages\pandas\tests\tslibs\test_to_offset.pyModuleNotFoundError: No module named 'pandas'
ОКРУЖЕНИЕ (нет пакета)$IMPORTS\goblin-corpus\train\venv\Lib\site-packages\pandas\tests\tslibs\test_tzconversion.pyModuleNotFoundError: No module named 'pandas'
ОКРУЖЕНИЕ (нет пакета)$IMPORTS\goblin-corpus\train\venv\Lib\site-packages\pandas\tests\util\test_assert_almost_equal.pyModuleNotFoundError: No module named 'pandas'
ОКРУЖЕНИЕ (нет пакета)$IMPORTS\goblin-corpus\train\venv\Lib\site-packages\pandas\tests\util\test_assert_attr_equal.pyModuleNotFoundError: No module named 'pandas'
ОКРУЖЕНИЕ (нет пакета)$IMPORTS\goblin-corpus\train\venv\Lib\site-packages\pandas\tests\util\test_assert_categorical_equal.pyModuleNotFoundError: No module named 'pandas'
ОКРУЖЕНИЕ (нет пакета)$IMPORTS\goblin-corpus\train\venv\Lib\site-packages\pandas\tests\util\test_assert_extension_array_equal.pyModuleNotFoundError: No module named 'pandas'
ОКРУЖЕНИЕ (нет пакета)$IMPORTS\goblin-corpus\train\venv\Lib\site-packages\pandas\tests\util\test_assert_frame_equal.pyModuleNotFoundError: No module named 'pandas'
ОКРУЖЕНИЕ (нет пакета)$IMPORTS\goblin-corpus\train\venv\Lib\site-packages\pandas\tests\util\test_assert_index_equal.pyModuleNotFoundError: No module named 'pandas'
ОКРУЖЕНИЕ (нет пакета)$IMPORTS\goblin-corpus\train\venv\Lib\site-packages\pandas\tests\util\test_assert_interval_array_equal.pyModuleNotFoundError: No module named 'pandas'
ОКРУЖЕНИЕ (нет пакета)$IMPORTS\goblin-corpus\train\venv\Lib\site-packages\pandas\tests\util\test_assert_numpy_array_equal.pyModuleNotFoundError: No module named 'pandas'
ОКРУЖЕНИЕ (нет пакета)$IMPORTS\goblin-corpus\train\venv\Lib\site-packages\pandas\tests\util\test_assert_produces_warning.pyModuleNotFoundError: No module named 'pandas'
ОКРУЖЕНИЕ (нет пакета)$IMPORTS\goblin-corpus\train\venv\Lib\site-packages\pandas\tests\util\test_assert_series_equal.pyModuleNotFoundError: No module named 'pandas'
ОКРУЖЕНИЕ (нет пакета)$IMPORTS\goblin-corpus\train\venv\Lib\site-packages\pandas\tests\util\test_deprecate.pyModuleNotFoundError: No module named 'pandas'
ОКРУЖЕНИЕ (нет пакета)$IMPORTS\goblin-corpus\train\venv\Lib\site-packages\pandas\tests\util\test_deprecate_kwarg.pyModuleNotFoundError: No module named 'pandas'
ОКРУЖЕНИЕ (нет пакета)$IMPORTS\goblin-corpus\train\venv\Lib\site-packages\pandas\tests\util\test_deprecate_nonkeyword_arguments.pyModuleNotFoundError: No module named 'pandas'
ОКРУЖЕНИЕ (нет пакета)$IMPORTS\goblin-corpus\train\venv\Lib\site-packages\pandas\tests\util\test_doc.pyModuleNotFoundError: No module named 'pandas'
ОКРУЖЕНИЕ (нет пакета)$IMPORTS\goblin-corpus\train\venv\Lib\site-packages\pandas\tests\util\test_hashing.pyModuleNotFoundError: No module named 'pandas'
ОКРУЖЕНИЕ (нет пакета)$IMPORTS\goblin-corpus\train\venv\Lib\site-packages\pandas\tests\util\test_numba.pyModuleNotFoundError: No module named 'pandas'
ОКРУЖЕНИЕ (нет пакета)$IMPORTS\goblin-corpus\train\venv\Lib\site-packages\pandas\tests\util\test_rewrite_warning.pyModuleNotFoundError: No module named 'pandas'
ОКРУЖЕНИЕ (нет пакета)$IMPORTS\goblin-corpus\train\venv\Lib\site-packages\pandas\tests\util\test_shares_memory.pyModuleNotFoundError: No module named 'pandas'
ОКРУЖЕНИЕ (нет пакета)$IMPORTS\goblin-corpus\train\venv\Lib\site-packages\pandas\tests\util\test_show_versions.pyModuleNotFoundError: No module named 'pandas'
ОКРУЖЕНИЕ (нет пакета)$IMPORTS\goblin-corpus\train\venv\Lib\site-packages\pandas\tests\util\test_util.pyModuleNotFoundError: No module named 'pandas'
ОКРУЖЕНИЕ (нет пакета)$IMPORTS\goblin-corpus\train\venv\Lib\site-packages\pandas\tests\util\test_validate_args.pyModuleNotFoundError: No module named 'pandas'
ОКРУЖЕНИЕ (нет пакета)$IMPORTS\goblin-corpus\train\venv\Lib\site-packages\pandas\tests\util\test_validate_args_and_kwargs.pyModuleNotFoundError: No module named 'pandas'
ОКРУЖЕНИЕ (нет пакета)$IMPORTS\goblin-corpus\train\venv\Lib\site-packages\pandas\tests\util\test_validate_inclusive.pyModuleNotFoundError: No module named 'pandas'
ОКРУЖЕНИЕ (нет пакета)$IMPORTS\goblin-corpus\train\venv\Lib\site-packages\pandas\tests\util\test_validate_kwargs.pyModuleNotFoundError: No module named 'pandas'
ОКРУЖЕНИЕ (нет пакета)$IMPORTS\goblin-corpus\train\venv\Lib\site-packages\pandas\tests\window\moments\test_moments_consistency_ewm.pyModuleNotFoundError: No module named 'pandas'
ОКРУЖЕНИЕ (нет пакета)$IMPORTS\goblin-corpus\train\venv\Lib\site-packages\pandas\tests\window\moments\test_moments_consistency_expanding.pyModuleNotFoundError: No module named 'pandas'
ОКРУЖЕНИЕ (нет пакета)$IMPORTS\goblin-corpus\train\venv\Lib\site-packages\pandas\tests\window\moments\test_moments_consistency_rolling.pyModuleNotFoundError: No module named 'pandas'
ОКРУЖЕНИЕ (нет пакета)$IMPORTS\goblin-corpus\train\venv\Lib\site-packages\pandas\tests\window\test_api.pyModuleNotFoundError: No module named 'pandas'
ОКРУЖЕНИЕ (нет пакета)$IMPORTS\goblin-corpus\train\venv\Lib\site-packages\pandas\tests\window\test_apply.pyModuleNotFoundError: No module named 'pandas'
ОКРУЖЕНИЕ (нет пакета)$IMPORTS\goblin-corpus\train\venv\Lib\site-packages\pandas\tests\window\test_base_indexer.pyModuleNotFoundError: No module named 'pandas'
ОКРУЖЕНИЕ (нет пакета)$IMPORTS\goblin-corpus\train\venv\Lib\site-packages\pandas\tests\window\test_cython_aggregations.pyModuleNotFoundError: No module named 'pandas'
ОКРУЖЕНИЕ (нет пакета)$IMPORTS\goblin-corpus\train\venv\Lib\site-packages\pandas\tests\window\test_dtypes.pyModuleNotFoundError: No module named 'pandas'
ОКРУЖЕНИЕ (нет пакета)$IMPORTS\goblin-corpus\train\venv\Lib\site-packages\pandas\tests\window\test_ewm.pyModuleNotFoundError: No module named 'pandas'
ОКРУЖЕНИЕ (нет пакета)$IMPORTS\goblin-corpus\train\venv\Lib\site-packages\pandas\tests\window\test_expanding.pyModuleNotFoundError: No module named 'pandas'
ОКРУЖЕНИЕ (нет пакета)$IMPORTS\goblin-corpus\train\venv\Lib\site-packages\pandas\tests\window\test_groupby.pyModuleNotFoundError: No module named 'pandas'
ОКРУЖЕНИЕ (нет пакета)$IMPORTS\goblin-corpus\train\venv\Lib\site-packages\pandas\tests\window\test_numba.pyModuleNotFoundError: No module named 'pandas'
ОКРУЖЕНИЕ (нет пакета)$IMPORTS\goblin-corpus\train\venv\Lib\site-packages\pandas\tests\window\test_online.pyModuleNotFoundError: No module named 'pandas'
ОКРУЖЕНИЕ (нет пакета)$IMPORTS\goblin-corpus\train\venv\Lib\site-packages\pandas\tests\window\test_pairwise.pyModuleNotFoundError: No module named 'pandas'
ОКРУЖЕНИЕ (нет пакета)$IMPORTS\goblin-corpus\train\venv\Lib\site-packages\pandas\tests\window\test_rolling.pyModuleNotFoundError: No module named 'pandas'
ОКРУЖЕНИЕ (нет пакета)$IMPORTS\goblin-corpus\train\venv\Lib\site-packages\pandas\tests\window\test_rolling_functions.pyModuleNotFoundError: No module named 'pandas'
ОКРУЖЕНИЕ (нет пакета)$IMPORTS\goblin-corpus\train\venv\Lib\site-packages\pandas\tests\window\test_rolling_quantile.pyModuleNotFoundError: No module named 'pandas'
ОКРУЖЕНИЕ (нет пакета)$IMPORTS\goblin-corpus\train\venv\Lib\site-packages\pandas\tests\window\test_rolling_skew_kurt.pyModuleNotFoundError: No module named 'pandas'
ОКРУЖЕНИЕ (нет пакета)$IMPORTS\goblin-corpus\train\venv\Lib\site-packages\pandas\tests\window\test_timeseries_window.pyModuleNotFoundError: No module named 'pandas'
ОКРУЖЕНИЕ (нет пакета)$IMPORTS\goblin-corpus\train\venv\Lib\site-packages\pandas\tests\window\test_win_type.pyModuleNotFoundError: No module named 'pandas'
ОКРУЖЕНИЕ (нет пакета)$IMPORTS\goblin-corpus\train\venv\Lib\site-packages\pandas\util\_test_decorators.pyModuleNotFoundError: No module named 'pandas'
ОКРУЖЕНИЕ (нет пакета)$IMPORTS\goblin-corpus\train\venv\Lib\site-packages\pkg_resources\tests\test_integration_zope_interface.pyModuleNotFoundError: No module named 'jaraco'
НАШЕ (на разбор)$IMPORTS\goblin-corpus\train\venv\Lib\site-packages\pkg_resources\tests\test_working_set.pyImportError: attempted relative import with no known parent package
ОКРУЖЕНИЕ (нет пакета)$IMPORTS\goblin-corpus\train\venv\Lib\site-packages\pyarrow\tests\interchange\test_conversion.pyModuleNotFoundError: No module named 'pyarrow'
ОКРУЖЕНИЕ (нет пакета)$IMPORTS\goblin-corpus\train\venv\Lib\site-packages\pyarrow\tests\interchange\test_interchange_spec.pyModuleNotFoundError: No module named 'hypothesis'
ОКРУЖЕНИЕ (нет пакета)$IMPORTS\goblin-corpus\train\venv\Lib\site-packages\pyarrow\tests\parquet\test_basic.pyModuleNotFoundError: No module named 'pyarrow'
ОКРУЖЕНИЕ (нет пакета)$IMPORTS\goblin-corpus\train\venv\Lib\site-packages\pyarrow\tests\parquet\test_compliant_nested_type.pyModuleNotFoundError: No module named 'pyarrow'
ОКРУЖЕНИЕ (нет пакета)$IMPORTS\goblin-corpus\train\venv\Lib\site-packages\pyarrow\tests\parquet\test_data_types.pyModuleNotFoundError: No module named 'pyarrow'
ОКРУЖЕНИЕ (нет пакета)$IMPORTS\goblin-corpus\train\venv\Lib\site-packages\pyarrow\tests\parquet\test_dataset.pyModuleNotFoundError: No module named 'pyarrow'
ОКРУЖЕНИЕ (нет пакета)$IMPORTS\goblin-corpus\train\venv\Lib\site-packages\pyarrow\tests\parquet\test_datetime.pyModuleNotFoundError: No module named 'pyarrow'
ОКРУЖЕНИЕ (нет пакета)$IMPORTS\goblin-corpus\train\venv\Lib\site-packages\pyarrow\tests\parquet\test_encryption.pyModuleNotFoundError: No module named 'pyarrow'
ОКРУЖЕНИЕ (нет пакета)$IMPORTS\goblin-corpus\train\venv\Lib\site-packages\pyarrow\tests\parquet\test_metadata.pyModuleNotFoundError: No module named 'pyarrow'
ОКРУЖЕНИЕ (нет пакета)$IMPORTS\goblin-corpus\train\venv\Lib\site-packages\pyarrow\tests\parquet\test_pandas.pyModuleNotFoundError: No module named 'pyarrow'
ОКРУЖЕНИЕ (нет пакета)$IMPORTS\goblin-corpus\train\venv\Lib\site-packages\pyarrow\tests\parquet\test_parquet_file.pyModuleNotFoundError: No module named 'pyarrow'
ОКРУЖЕНИЕ (нет пакета)$IMPORTS\goblin-corpus\train\venv\Lib\site-packages\pyarrow\tests\parquet\test_parquet_writer.pyModuleNotFoundError: No module named 'pyarrow'
ОКРУЖЕНИЕ (нет пакета)$IMPORTS\goblin-corpus\train\venv\Lib\site-packages\pyarrow\tests\test_acero.pyModuleNotFoundError: No module named 'pyarrow'
ОКРУЖЕНИЕ (нет пакета)$IMPORTS\goblin-corpus\train\venv\Lib\site-packages\pyarrow\tests\test_adhoc_memory_leak.pyModuleNotFoundError: No module named 'pyarrow'
ОКРУЖЕНИЕ (нет пакета)$IMPORTS\goblin-corpus\train\venv\Lib\site-packages\pyarrow\tests\test_array.pyModuleNotFoundError: No module named 'hypothesis'
ОКРУЖЕНИЕ (нет пакета)$IMPORTS\goblin-corpus\train\venv\Lib\site-packages\pyarrow\tests\test_builder.pyModuleNotFoundError: No module named 'pyarrow'
ОКРУЖЕНИЕ (нет пакета)$IMPORTS\goblin-corpus\train\venv\Lib\site-packages\pyarrow\tests\test_cffi.pyModuleNotFoundError: No module named 'pyarrow'
ОКРУЖЕНИЕ (нет пакета)$IMPORTS\goblin-corpus\train\venv\Lib\site-packages\pyarrow\tests\test_compute.pyModuleNotFoundError: No module named 'pyarrow'
ОКРУЖЕНИЕ (нет пакета)$IMPORTS\goblin-corpus\train\venv\Lib\site-packages\pyarrow\tests\test_convert_builtin.pyModuleNotFoundError: No module named 'hypothesis'
ОКРУЖЕНИЕ (нет пакета)$IMPORTS\goblin-corpus\train\venv\Lib\site-packages\pyarrow\tests\test_cpp_internals.pyModuleNotFoundError: No module named 'pyarrow'
ОКРУЖЕНИЕ (нет пакета)$IMPORTS\goblin-corpus\train\venv\Lib\site-packages\pyarrow\tests\test_csv.pyModuleNotFoundError: No module named 'pyarrow'
ОКРУЖЕНИЕ (нет пакета)$IMPORTS\goblin-corpus\train\venv\Lib\site-packages\pyarrow\tests\test_cuda.pyModuleNotFoundError: No module named 'pyarrow'
ОКРУЖЕНИЕ (нет пакета)$IMPORTS\goblin-corpus\train\venv\Lib\site-packages\pyarrow\tests\test_cuda_numba_interop.pyModuleNotFoundError: No module named 'pyarrow'
ОКРУЖЕНИЕ (нет пакета)$IMPORTS\goblin-corpus\train\venv\Lib\site-packages\pyarrow\tests\test_cython.pyModuleNotFoundError: No module named 'pyarrow'
ОКРУЖЕНИЕ (нет пакета)$IMPORTS\goblin-corpus\train\venv\Lib\site-packages\pyarrow\tests\test_dataset.pyModuleNotFoundError: No module named 'pyarrow'
ОКРУЖЕНИЕ (нет пакета)$IMPORTS\goblin-corpus\train\venv\Lib\site-packages\pyarrow\tests\test_dataset_encryption.pyModuleNotFoundError: No module named 'pyarrow'
ОКРУЖЕНИЕ (нет пакета)$IMPORTS\goblin-corpus\train\venv\Lib\site-packages\pyarrow\tests\test_deprecations.pyModuleNotFoundError: No module named 'pyarrow'
ОКРУЖЕНИЕ (нет пакета)$IMPORTS\goblin-corpus\train\venv\Lib\site-packages\pyarrow\tests\test_device.pyModuleNotFoundError: No module named 'pyarrow'
ОКРУЖЕНИЕ (нет пакета)$IMPORTS\goblin-corpus\train\venv\Lib\site-packages\pyarrow\tests\test_dlpack.pyModuleNotFoundError: No module named 'pyarrow'
ОКРУЖЕНИЕ (нет пакета)$IMPORTS\goblin-corpus\train\venv\Lib\site-packages\pyarrow\tests\test_exec_plan.pyModuleNotFoundError: No module named 'pyarrow'
ОКРУЖЕНИЕ (нет пакета)$IMPORTS\goblin-corpus\train\venv\Lib\site-packages\pyarrow\tests\test_extension_type.pyModuleNotFoundError: No module named 'pyarrow'
ОКРУЖЕНИЕ (нет пакета)$IMPORTS\goblin-corpus\train\venv\Lib\site-packages\pyarrow\tests\test_feather.pyModuleNotFoundError: No module named 'hypothesis'
ОКРУЖЕНИЕ (нет пакета)$IMPORTS\goblin-corpus\train\venv\Lib\site-packages\pyarrow\tests\test_flight.pyModuleNotFoundError: No module named 'pyarrow'
ОКРУЖЕНИЕ (нет пакета)$IMPORTS\goblin-corpus\train\venv\Lib\site-packages\pyarrow\tests\test_flight_async.pyModuleNotFoundError: No module named 'pyarrow'
ОКРУЖЕНИЕ (нет пакета)$IMPORTS\goblin-corpus\train\venv\Lib\site-packages\pyarrow\tests\test_fs.pyModuleNotFoundError: No module named 'pyarrow'
ОКРУЖЕНИЕ (нет пакета)$IMPORTS\goblin-corpus\train\venv\Lib\site-packages\pyarrow\tests\test_gandiva.pyModuleNotFoundError: No module named 'pyarrow'
ОКРУЖЕНИЕ (нет пакета)$IMPORTS\goblin-corpus\train\venv\Lib\site-packages\pyarrow\tests\test_gdb.pyModuleNotFoundError: No module named 'pyarrow'
ОКРУЖЕНИЕ (нет пакета)$IMPORTS\goblin-corpus\train\venv\Lib\site-packages\pyarrow\tests\test_io.pyModuleNotFoundError: No module named 'pyarrow'
ОКРУЖЕНИЕ (нет пакета)$IMPORTS\goblin-corpus\train\venv\Lib\site-packages\pyarrow\tests\test_ipc.pyModuleNotFoundError: No module named 'pyarrow'
ОКРУЖЕНИЕ (нет пакета)$IMPORTS\goblin-corpus\train\venv\Lib\site-packages\pyarrow\tests\test_json.pyModuleNotFoundError: No module named 'pyarrow'
ОКРУЖЕНИЕ (нет пакета)$IMPORTS\goblin-corpus\train\venv\Lib\site-packages\pyarrow\tests\test_jvm.pyModuleNotFoundError: No module named 'pyarrow'
ОКРУЖЕНИЕ (нет пакета)$IMPORTS\goblin-corpus\train\venv\Lib\site-packages\pyarrow\tests\test_memory.pyModuleNotFoundError: No module named 'pyarrow'
ОКРУЖЕНИЕ (нет пакета)$IMPORTS\goblin-corpus\train\venv\Lib\site-packages\pyarrow\tests\test_misc.pyModuleNotFoundError: No module named 'pyarrow'
ОКРУЖЕНИЕ (нет пакета)$IMPORTS\goblin-corpus\train\venv\Lib\site-packages\pyarrow\tests\test_orc.pyModuleNotFoundError: No module named 'pyarrow'
ОКРУЖЕНИЕ (нет пакета)$IMPORTS\goblin-corpus\train\venv\Lib\site-packages\pyarrow\tests\test_pandas.pyModuleNotFoundError: No module named 'hypothesis'
ОКРУЖЕНИЕ (нет пакета)$IMPORTS\goblin-corpus\train\venv\Lib\site-packages\pyarrow\tests\test_scalars.pyModuleNotFoundError: No module named 'pyarrow'
ОКРУЖЕНИЕ (нет пакета)$IMPORTS\goblin-corpus\train\venv\Lib\site-packages\pyarrow\tests\test_schema.pyModuleNotFoundError: No module named 'pyarrow'
ОКРУЖЕНИЕ (нет пакета)$IMPORTS\goblin-corpus\train\venv\Lib\site-packages\pyarrow\tests\test_sparse_tensor.pyModuleNotFoundError: No module named 'pyarrow'
ОКРУЖЕНИЕ (нет пакета)$IMPORTS\goblin-corpus\train\venv\Lib\site-packages\pyarrow\tests\test_strategies.pyModuleNotFoundError: No module named 'hypothesis'
ОКРУЖЕНИЕ (нет пакета)$IMPORTS\goblin-corpus\train\venv\Lib\site-packages\pyarrow\tests\test_substrait.pyModuleNotFoundError: No module named 'pyarrow'
ОКРУЖЕНИЕ (нет пакета)$IMPORTS\goblin-corpus\train\venv\Lib\site-packages\pyarrow\tests\test_table.pyModuleNotFoundError: No module named 'pyarrow'
ОКРУЖЕНИЕ (нет пакета)$IMPORTS\goblin-corpus\train\venv\Lib\site-packages\pyarrow\tests\test_tensor.pyModuleNotFoundError: No module named 'pyarrow'
ОКРУЖЕНИЕ (нет пакета)$IMPORTS\goblin-corpus\train\venv\Lib\site-packages\pyarrow\tests\test_types.pyModuleNotFoundError: No module named 'hypothesis'
ОКРУЖЕНИЕ (нет пакета)$IMPORTS\goblin-corpus\train\venv\Lib\site-packages\pyarrow\tests\test_udf.pyModuleNotFoundError: No module named 'pyarrow'
ОКРУЖЕНИЕ (нет пакета)$IMPORTS\goblin-corpus\train\venv\Lib\site-packages\pyarrow\tests\test_util.pyModuleNotFoundError: No module named 'pyarrow'
ОКРУЖЕНИЕ (нет пакета)$IMPORTS\goblin-corpus\train\venv\Lib\site-packages\pyarrow\tests\test_without_numpy.pyModuleNotFoundError: No module named 'pyarrow'
НАШЕ (на разбор)$IMPORTS\goblin-corpus\train\venv\Lib\site-packages\setuptools\_distutils\compilers\C\tests\test_base.pyImportError: attempted relative import with no known parent package
ОКРУЖЕНИЕ (нет пакета)$IMPORTS\goblin-corpus\train\venv\Lib\site-packages\setuptools\_distutils\compilers\C\tests\test_cygwin.pyModuleNotFoundError: No module named 'distutils.tests'
НАШЕ (на разбор)$IMPORTS\goblin-corpus\train\venv\Lib\site-packages\setuptools\_distutils\compilers\C\tests\test_mingw.pyImportError: attempted relative import with no known parent package
ОКРУЖЕНИЕ (нет пакета)$IMPORTS\goblin-corpus\train\venv\Lib\site-packages\setuptools\_distutils\compilers\C\tests\test_msvc.pyModuleNotFoundError: No module named 'distutils.tests'
ОКРУЖЕНИЕ (нет пакета)$IMPORTS\goblin-corpus\train\venv\Lib\site-packages\setuptools\_distutils\compilers\C\tests\test_unix.pyModuleNotFoundError: No module named 'distutils.tests'
ОКРУЖЕНИЕ (нет пакета)$IMPORTS\goblin-corpus\train\venv\Lib\site-packages\setuptools\_distutils\tests\test_archive_util.pyModuleNotFoundError: No module named 'distutils.tests'
ОКРУЖЕНИЕ (нет пакета)$IMPORTS\goblin-corpus\train\venv\Lib\site-packages\setuptools\_distutils\tests\test_bdist.pyModuleNotFoundError: No module named 'distutils.tests'
ОКРУЖЕНИЕ (нет пакета)$IMPORTS\goblin-corpus\train\venv\Lib\site-packages\setuptools\_distutils\tests\test_bdist_dumb.pyModuleNotFoundError: No module named 'distutils.tests'
ОКРУЖЕНИЕ (нет пакета)$IMPORTS\goblin-corpus\train\venv\Lib\site-packages\setuptools\_distutils\tests\test_bdist_rpm.pyModuleNotFoundError: No module named 'distutils.tests'
ОКРУЖЕНИЕ (нет пакета)$IMPORTS\goblin-corpus\train\venv\Lib\site-packages\setuptools\_distutils\tests\test_build.pyModuleNotFoundError: No module named 'distutils.tests'
ОКРУЖЕНИЕ (нет пакета)$IMPORTS\goblin-corpus\train\venv\Lib\site-packages\setuptools\_distutils\tests\test_build_clib.pyModuleNotFoundError: No module named 'distutils.tests'
ОКРУЖЕНИЕ (нет пакета)$IMPORTS\goblin-corpus\train\venv\Lib\site-packages\setuptools\_distutils\tests\test_build_ext.pyModuleNotFoundError: No module named 'distutils.tests'
ОКРУЖЕНИЕ (нет пакета)$IMPORTS\goblin-corpus\train\venv\Lib\site-packages\setuptools\_distutils\tests\test_build_py.pyModuleNotFoundError: No module named 'distutils.tests'
ОКРУЖЕНИЕ (нет пакета)$IMPORTS\goblin-corpus\train\venv\Lib\site-packages\setuptools\_distutils\tests\test_build_scripts.pyModuleNotFoundError: No module named 'distutils.tests'
ОКРУЖЕНИЕ (нет пакета)$IMPORTS\goblin-corpus\train\venv\Lib\site-packages\setuptools\_distutils\tests\test_check.pyModuleNotFoundError: No module named 'distutils.tests'
ОКРУЖЕНИЕ (нет пакета)$IMPORTS\goblin-corpus\train\venv\Lib\site-packages\setuptools\_distutils\tests\test_clean.pyModuleNotFoundError: No module named 'distutils.tests'
ОКРУЖЕНИЕ (нет пакета)$IMPORTS\goblin-corpus\train\venv\Lib\site-packages\setuptools\_distutils\tests\test_config_cmd.pyModuleNotFoundError: No module named 'distutils.tests'
ОКРУЖЕНИЕ (нет пакета)$IMPORTS\goblin-corpus\train\venv\Lib\site-packages\setuptools\_distutils\tests\test_dir_util.pyModuleNotFoundError: No module named 'distutils.tests'
ОКРУЖЕНИЕ (нет пакета)$IMPORTS\goblin-corpus\train\venv\Lib\site-packages\setuptools\_distutils\tests\test_dist.pyModuleNotFoundError: No module named 'distutils.tests'
ОКРУЖЕНИЕ (нет пакета)$IMPORTS\goblin-corpus\train\venv\Lib\site-packages\setuptools\_distutils\tests\test_file_util.pyModuleNotFoundError: No module named 'jaraco'
ОКРУЖЕНИЕ (нет пакета)$IMPORTS\goblin-corpus\train\venv\Lib\site-packages\setuptools\_distutils\tests\test_filelist.pyModuleNotFoundError: No module named 'jaraco'
ОКРУЖЕНИЕ (нет пакета)$IMPORTS\goblin-corpus\train\venv\Lib\site-packages\setuptools\_distutils\tests\test_install.pyModuleNotFoundError: No module named 'distutils.tests'
ОКРУЖЕНИЕ (нет пакета)$IMPORTS\goblin-corpus\train\venv\Lib\site-packages\setuptools\_distutils\tests\test_install_data.pyModuleNotFoundError: No module named 'distutils.tests'
ОКРУЖЕНИЕ (нет пакета)$IMPORTS\goblin-corpus\train\venv\Lib\site-packages\setuptools\_distutils\tests\test_install_headers.pyModuleNotFoundError: No module named 'distutils.tests'
ОКРУЖЕНИЕ (нет пакета)$IMPORTS\goblin-corpus\train\venv\Lib\site-packages\setuptools\_distutils\tests\test_install_lib.pyModuleNotFoundError: No module named 'distutils.tests'
ОКРУЖЕНИЕ (нет пакета)$IMPORTS\goblin-corpus\train\venv\Lib\site-packages\setuptools\_distutils\tests\test_install_scripts.pyModuleNotFoundError: No module named 'distutils.tests'
ОКРУЖЕНИЕ (нет пакета)$IMPORTS\goblin-corpus\train\venv\Lib\site-packages\setuptools\_distutils\tests\test_modified.pyModuleNotFoundError: No module named 'distutils.tests'
ОКРУЖЕНИЕ (нет пакета)$IMPORTS\goblin-corpus\train\venv\Lib\site-packages\setuptools\_distutils\tests\test_sdist.pyModuleNotFoundError: No module named 'jaraco'
ОКРУЖЕНИЕ (нет пакета)$IMPORTS\goblin-corpus\train\venv\Lib\site-packages\setuptools\_distutils\tests\test_spawn.pyModuleNotFoundError: No module named 'distutils.tests'
ОКРУЖЕНИЕ (нет пакета)$IMPORTS\goblin-corpus\train\venv\Lib\site-packages\setuptools\_distutils\tests\test_sysconfig.pyModuleNotFoundError: No module named 'jaraco'
ОКРУЖЕНИЕ (нет пакета)$IMPORTS\goblin-corpus\train\venv\Lib\site-packages\setuptools\_distutils\tests\test_text_file.pyModuleNotFoundError: No module named 'distutils.tests'
ОКРУЖЕНИЕ (нет пакета)$IMPORTS\goblin-corpus\train\venv\Lib\site-packages\setuptools\tests\config\test_apply_pyprojecttoml.pyModuleNotFoundError: No module named 'ini2toml'
ОКРУЖЕНИЕ (нет пакета)$IMPORTS\goblin-corpus\train\venv\Lib\site-packages\setuptools\tests\config\test_expand.pyModuleNotFoundError: No module named 'setuptools._static'
ОКРУЖЕНИЕ (нет пакета)$IMPORTS\goblin-corpus\train\venv\Lib\site-packages\setuptools\tests\config\test_pyprojecttoml.pyModuleNotFoundError: No module named 'jaraco'
ОКРУЖЕНИЕ (нет пакета)$IMPORTS\goblin-corpus\train\venv\Lib\site-packages\setuptools\tests\config\test_pyprojecttoml_dynamic_deps.pyModuleNotFoundError: No module named 'jaraco'
НАШЕ (на разбор)$IMPORTS\goblin-corpus\train\venv\Lib\site-packages\setuptools\tests\config\test_setupcfg.pyImportError: attempted relative import with no known parent package
НАШЕ (на разбор)$IMPORTS\goblin-corpus\train\venv\Lib\site-packages\setuptools\tests\integration\test_pip_install_sdist.pyImportError: attempted relative import with no known parent package
НАШЕ (на разбор)$IMPORTS\goblin-corpus\train\venv\Lib\site-packages\setuptools\tests\test_archive_util.pyAttributeError: module 'textwrap' has no attribute 'dedent'
НАШЕ (на разбор)$IMPORTS\goblin-corpus\train\venv\Lib\site-packages\setuptools\tests\test_bdist_deprecations.pyAttributeError: module 'textwrap' has no attribute 'dedent'
НАШЕ (на разбор)$IMPORTS\goblin-corpus\train\venv\Lib\site-packages\setuptools\tests\test_bdist_egg.pyAttributeError: module 'textwrap' has no attribute 'dedent'
ОКРУЖЕНИЕ (нет пакета)$IMPORTS\goblin-corpus\train\venv\Lib\site-packages\setuptools\tests\test_bdist_wheel.pyModuleNotFoundError: No module named 'jaraco'
НАШЕ (на разбор)$IMPORTS\goblin-corpus\train\venv\Lib\site-packages\setuptools\tests\test_build.pyAttributeError: module 'textwrap' has no attribute 'dedent'
НАШЕ (на разбор)$IMPORTS\goblin-corpus\train\venv\Lib\site-packages\setuptools\tests\test_build_clib.pyAttributeError: module 'textwrap' has no attribute 'dedent'
НАШЕ (на разбор)$IMPORTS\goblin-corpus\train\venv\Lib\site-packages\setuptools\tests\test_build_ext.pyAttributeError: module 'textwrap' has no attribute 'dedent'
НАШЕ (на разбор)$IMPORTS\goblin-corpus\train\venv\Lib\site-packages\setuptools\tests\test_build_meta.pyAttributeError: module 'textwrap' has no attribute 'dedent'
ОКРУЖЕНИЕ (нет пакета)$IMPORTS\goblin-corpus\train\venv\Lib\site-packages\setuptools\tests\test_build_py.pyModuleNotFoundError: No module named 'jaraco'
ОКРУЖЕНИЕ (нет пакета)$IMPORTS\goblin-corpus\train\venv\Lib\site-packages\setuptools\tests\test_config_discovery.pyModuleNotFoundError: No module named 'jaraco'
ОКРУЖЕНИЕ (нет пакета)$IMPORTS\goblin-corpus\train\venv\Lib\site-packages\setuptools\tests\test_core_metadata.pyModuleNotFoundError: No module named 'jaraco'
НАШЕ (на разбор)$IMPORTS\goblin-corpus\train\venv\Lib\site-packages\setuptools\tests\test_depends.pyAttributeError: module 'textwrap' has no attribute 'dedent'
НАШЕ (на разбор)$IMPORTS\goblin-corpus\train\venv\Lib\site-packages\setuptools\tests\test_develop.pyAttributeError: module 'textwrap' has no attribute 'dedent'
НАШЕ (на разбор)$IMPORTS\goblin-corpus\train\venv\Lib\site-packages\setuptools\tests\test_dist.pyAttributeError: module 'textwrap' has no attribute 'dedent'
НАШЕ (на разбор)$IMPORTS\goblin-corpus\train\venv\Lib\site-packages\setuptools\tests\test_dist_info.pyAttributeError: module 'textwrap' has no attribute 'dedent'
НАШЕ (на разбор)$IMPORTS\goblin-corpus\train\venv\Lib\site-packages\setuptools\tests\test_distutils_adoption.pyAttributeError: module 'textwrap' has no attribute 'dedent'
НАШЕ (на разбор)$IMPORTS\goblin-corpus\train\venv\Lib\site-packages\setuptools\tests\test_easy_install.pyAttributeError: module 'textwrap' has no attribute 'dedent'
НАШЕ (на разбор)$IMPORTS\goblin-corpus\train\venv\Lib\site-packages\setuptools\tests\test_editable_install.pyImportError: cannot import name 'dedent' from 'textwrap' (E:\Obsidian\_imports\goblin-corpus\train\venv\Lib\si
НАШЕ (на разбор)$IMPORTS\goblin-corpus\train\venv\Lib\site-packages\setuptools\tests\test_egg_info.pyAttributeError: module 'textwrap' has no attribute 'dedent'
НАШЕ (на разбор)$IMPORTS\goblin-corpus\train\venv\Lib\site-packages\setuptools\tests\test_extern.pyAttributeError: module 'textwrap' has no attribute 'dedent'
НАШЕ (на разбор)$IMPORTS\goblin-corpus\train\venv\Lib\site-packages\setuptools\tests\test_find_packages.pyAttributeError: module 'textwrap' has no attribute 'dedent'
НАШЕ (на разбор)$IMPORTS\goblin-corpus\train\venv\Lib\site-packages\setuptools\tests\test_find_py_modules.pyAttributeError: module 'textwrap' has no attribute 'dedent'
НАШЕ (на разбор)$IMPORTS\goblin-corpus\train\venv\Lib\site-packages\setuptools\tests\test_glob.pyAttributeError: module 'textwrap' has no attribute 'dedent'
НАШЕ (на разбор)$IMPORTS\goblin-corpus\train\venv\Lib\site-packages\setuptools\tests\test_install_scripts.pyAttributeError: module 'textwrap' has no attribute 'dedent'
НАШЕ (на разбор)$IMPORTS\goblin-corpus\train\venv\Lib\site-packages\setuptools\tests\test_logging.pyAttributeError: module 'textwrap' has no attribute 'dedent'
НАШЕ (на разбор)$IMPORTS\goblin-corpus\train\venv\Lib\site-packages\setuptools\tests\test_manifest.pyAttributeError: module 'textwrap' has no attribute 'dedent'
НАШЕ (на разбор)$IMPORTS\goblin-corpus\train\venv\Lib\site-packages\setuptools\tests\test_namespaces.pyAttributeError: module 'textwrap' has no attribute 'dedent'
НАШЕ (на разбор)$IMPORTS\goblin-corpus\train\venv\Lib\site-packages\setuptools\tests\test_packageindex.pyAttributeError: module 'textwrap' has no attribute 'dedent'
НАШЕ (на разбор)$IMPORTS\goblin-corpus\train\venv\Lib\site-packages\setuptools\tests\test_sandbox.pyAttributeError: module 'textwrap' has no attribute 'dedent'
ОКРУЖЕНИЕ (нет пакета)$IMPORTS\goblin-corpus\train\venv\Lib\site-packages\setuptools\tests\test_sdist.pyModuleNotFoundError: No module named 'jaraco'
НАШЕ (на разбор)$IMPORTS\goblin-corpus\train\venv\Lib\site-packages\setuptools\tests\test_setopt.pyAttributeError: module 'textwrap' has no attribute 'dedent'
НАШЕ (на разбор)$IMPORTS\goblin-corpus\train\venv\Lib\site-packages\setuptools\tests\test_setuptools.pyAttributeError: module 'textwrap' has no attribute 'dedent'
НАШЕ (на разбор)$IMPORTS\goblin-corpus\train\venv\Lib\site-packages\setuptools\tests\test_shutil_wrapper.pyAttributeError: module 'textwrap' has no attribute 'dedent'
НАШЕ (на разбор)$IMPORTS\goblin-corpus\train\venv\Lib\site-packages\setuptools\tests\test_unicode_utils.pyAttributeError: module 'textwrap' has no attribute 'dedent'
НАШЕ (на разбор)$IMPORTS\goblin-corpus\train\venv\Lib\site-packages\setuptools\tests\test_virtualenv.pyAttributeError: module 'textwrap' has no attribute 'dedent'
НАШЕ (на разбор)$IMPORTS\goblin-corpus\train\venv\Lib\site-packages\setuptools\tests\test_warnings.pyAttributeError: module 'textwrap' has no attribute 'dedent'
НАШЕ (на разбор)$IMPORTS\goblin-corpus\train\venv\Lib\site-packages\setuptools\tests\test_wheel.pyAttributeError: module 'textwrap' has no attribute 'dedent'
НАШЕ (на разбор)$IMPORTS\goblin-corpus\train\venv\Lib\site-packages\setuptools\tests\test_windows_wrappers.pyAttributeError: module 'textwrap' has no attribute 'dedent'
ОКРУЖЕНИЕ (нет пакета)$IMPORTS\goblin-corpus\train\venv\Lib\site-packages\sympy\ntheory\tests\test_hypothesis.pyModuleNotFoundError: No module named 'hypothesis'
НАШЕ (на разбор)$IMPORTS\goblin-corpus\train\venv\Lib\site-packages\sympy\parsing\tests\test_latex_lark.pyImportError: attempted relative import with no known parent package
ОКРУЖЕНИЕ (нет пакета)$IMPORTS\goblin-corpus\train\venv\Lib\site-packages\sympy\polys\tests\test_hypothesis.pyModuleNotFoundError: No module named 'hypothesis'
НАШЕ (на разбор)$IMPORTS\goblin-corpus\train\venv\Lib\site-packages\torch\_dynamo\test_case.pyImportError: cannot import name 'MappingProxyType' from partially initialized module 'types' (most likely due
НАШЕ (на разбор)$IMPORTS\goblin-corpus\train\venv\Lib\site-packages\torch\_dynamo\test_dont_skip_tracing_functions.pyImportError: cannot import name 'MappingProxyType' from partially initialized module 'types' (most likely due
НАШЕ (на разбор)$IMPORTS\goblin-corpus\train\venv\Lib\site-packages\torch\_dynamo\test_minifier_common.pyImportError: cannot import name 'GenericAlias' from partially initialized module 'types' (most likely due to a
ОКРУЖЕНИЕ (нет пакета)$IMPORTS\goblin-corpus\train\venv\Lib\site-packages\torch\_inductor\test_case.pyModuleNotFoundError: No module named 'expecttest'
НАШЕ (на разбор)$IMPORTS\goblin-corpus\train\venv\Lib\site-packages\torch\fx\passes\tests\test_pass_manager.pyImportError: attempted relative import with no known parent package
НАШЕ (на разбор)$IMPORTS\jobs-watch\selenium_apply\_test_answers_canon.py⛔ ПРОВАЛОВ: 1 из 99
НАШЕ (на разбор)$IMPORTS\compress\_test_ccr.pyИТОГ: 19 ✅ / 0 ❌